program: Gaussian 09
title: 000210315
version: EM64L-G09RevD.01
frameworkgroup: C1[X(C10H21NO5S2)]
method: RPBEPBE
basis: SDD
operation: Freq
keyword: #p
keyword: freq=noraman
keyword: PBEPBE/SDD
title: #p freq=noraman PBEPBE/SDD
converged: YES YES NO NO
title: Mulliken charges:
elementType: S S O O O O O N C C C C C C C C C C H H H H H H H H H H H H H H H H H H H H H
charge: 0.703473 -0.073488 -0.248818 -0.282189 -0.348906 -0.550561 -0.496755 -0.274443 -0.426954 -0.405720 -0.002256 -0.385986 -0.308154 -0.221588 -0.413655 -0.357271 -0.409732 -0.238574 0.218934 0.205023 0.217148 0.220542 0.212137 0.201594 0.209145 0.217133 0.197468 0.186052 0.208293 0.200370 0.235845 0.198463 0.218238 0.279279 0.250023 0.241105 0.237523 0.214476 0.372786
chargesum: 0.00000
title: Mulliken charges with hydrogens summed into heavy atoms:
elementType: S S O O O O O N C C C C C C C C C C
charge: 0.703473 -0.073488 -0.248818 -0.282189 -0.348906 -0.177775 -0.496755 0.004836 -0.002997 0.031970 0.209881 0.024752 0.106447 0.172757 0.022560 0.059430 0.081396 0.213425
polarizability: 4.07060721e+02 4.53301740e+01 1.73058207e+02 -2.22469074e+01 1.07318192e-01 1.42781306e+02
1716.lowfreq: -31.4846 -7.6647 -2.2633 0.0009 0.0014 0.0018 5.7867 7.7893 18.0636
frequency: -26.0327 6.5674 16.9089 23.8640 42.3167 57.2167 60.7848 73.8731 93.0711 103.8882 114.9960 122.5115 132.4927 169.5253 171.3616 193.0825 208.3049 224.4080 242.4121 266.6197 281.1166 302.7051 321.5889 348.9597 369.7605 410.6201 422.2926 454.7965 472.7150 501.8495 522.2297 537.8071 544.5624 558.2709 668.2077 767.0942 771.7765 795.2748 813.6005 846.8007 860.0656 870.7919 875.3596 877.0735 884.8980 937.7298 959.5316 994.0525 999.6213 1007.9359 1027.1044 1041.8519 1047.4240 1054.1525 1078.6459 1096.6756 1110.9054 1119.1909 1144.9872 1167.0965 1172.3338 1183.1011 1183.5430 1211.6854 1254.5252 1256.5661 1266.0701 1270.4906 1276.9234 1295.9154 1309.7271 1315.1034 1328.1274 1332.7921 1343.2491 1347.0172 1351.9037 1363.3538 1365.7416 1389.9288 1446.1314 1456.2151 1456.5446 1457.7769 1461.2590 1472.0640 1472.1727 1481.0407 1486.9562 1497.2951 2885.2351 2936.3769 2971.9251 2973.1604 2984.0637 2987.7384 2990.2068 2996.7877 3003.2231 3008.1864 3010.4673 3028.0996 3043.6953 3043.9757 3057.8937 3071.7297 3072.4607 3082.3357 3103.5822 3460.5399 3492.7154
redmass: 4.1011 7.9288 6.1534 4.0453 4.5475 3.9519 3.1569 5.4213 2.3533 2.4581 2.2362 3.5953 2.9556 3.7854 6.5834 3.1101 5.4228 4.8753 2.7151 4.0633 3.8081 2.6559 3.7247 2.1178 4.0055 2.9137 4.1023 8.8265 6.5305 2.3549 4.0043 4.2086 1.8871 3.6518 3.1777 3.0315 1.2013 1.8653 1.1769 2.8038 1.9144 2.2873 2.3387 2.5294 6.9471 1.6195 3.5722 3.6581 5.3301 2.4354 2.9366 1.2274 2.7529 2.0340 2.1671 1.9758 2.0860 2.0524 1.6823 1.3012 1.2985 1.4705 2.9296 1.2976 1.2345 1.1900 1.1736 1.2091 1.1202 1.1987 1.3372 1.2222 1.1987 1.1522 1.4115 1.4610 1.4276 1.2871 1.3296 1.4990 1.0888 1.0938 1.0889 1.0858 1.2638 1.0901 1.0762 1.0845 1.0803 1.0852 1.0696 1.0612 1.0532 1.0666 1.0598 1.0800 1.0672 1.0611 1.0983 1.0691 1.0843 1.0588 1.1004 1.1084 1.1011 1.1014 1.1024 1.0999 1.1082 1.0662 1.0757
irintensity: 0.0283 0.7043 0.2300 0.3333 0.5059 0.6372 3.8413 3.0941 1.5451 4.1455 54.9376 14.6725 2.7663 7.8734 4.1653 14.0221 29.2424 18.6245 5.8123 10.3415 16.2344 1.2498 33.1950 4.5242 22.1410 14.2405 26.2396 84.3264 89.2029 15.9139 109.8193 120.6047 189.4911 7.1215 0.9376 23.9787 2.7954 24.3851 8.1220 14.1130 64.0644 94.3287 81.4453 63.2873 77.9092 31.0092 119.9407 94.5612 39.0510 9.6068 74.3937 46.3360 41.4822 40.5296 27.0959 21.5026 42.9536 16.9875 5.8724 17.7681 2.7748 24.4243 27.8660 9.2971 5.9042 4.1449 8.7598 9.5341 4.7344 1.7042 29.0900 5.3477 12.4676 30.3011 0.8255 4.6765 1.3637 8.7067 35.2253 13.9721 8.6785 32.0896 9.2323 7.3992 25.4374 12.2345 8.7434 12.9130 16.0845 9.7147 46.5968 45.8808 30.3131 44.7898 39.0116 22.8766 24.7553 40.8013 25.3204 54.8688 35.8358 39.7590 28.8658 17.7270 51.7974 43.6077 43.9625 46.7091 23.6716 48.9728 63.7664
temp: 298.150 k
press: 1.00000 atm
elementType: 16 16 8 8 8 8 8 7 6 6 6 6 6 6 6 6 6 6 1 1 1 1 1 1 1 1 1 1 1 1 1 1 1 1 1 1 1 1 1
symmnumber: 1
zpe: 824832.8 jmol-1
zpe.correction: 0.314162 hartree
zpe.thermalcorrener: 0.335996 hartree
zpe.thermalcorrenthalpy: 0.336940 hartree
zpe.thermalcorrgfe: 0.257958 hartree
zpe.sumelectzpe: -1618.968214 hartree
zpe.sumelectthermal: -1618.946380 hartree
zpe.sumelectthermalent: -1618.945436 hartree
zpe.sumelectthermalfe: -1619.024418 hartree
dipole: -6.1603 -0.0358 0.9121
dipole: 6.2276
quadrupole: -150.6979 -122.9017 -125.7750
quadrupole: 1.6213 -5.4898 -0.6282
quadrupole: -17.5730 10.2232 7.3499 1.6213 -5.4898 -0.6282
hfenergy: -1619.282376 hartree
pointgroup: C01 [X(C10H21N1O5S2)]
dipole: 2.4004621 0.1729701 0.4593113 debye
polarizability: 400.0399413|58.7148053|177.6636941|27.928748|-0.3972086|145.1965995 unknown
InChI: InChI=1S/C10H21NO5S2/c12-18(13,17)16-9-6-11-5-3-8-15-10-4-1-2-7-14-10/h10-12H,1-9H2
charge 0 multiplicity 1
39 atoms
S  -5.977676 -1.100369 -0.082056
S  -7.932567 -0.619997 -0.760895
O  4.466684 -1.433811 -0.590139
O  3.423193 0.725254 -0.238276
O  -4.838491 0.442674 -0.229282
O  -5.021297 -2.115538 -1.35125
O  -5.723247 -1.867395 1.323777
N  -1.357796 1.593386 0.36008
C  5.829527 0.648673 -0.375242
C  6.082744 0.331099 1.117177
C  4.527793 0.002337 -0.871955
C  6.025484 -1.197565 1.350549
C  4.684661 -1.754711 0.843549
C  2.097998 0.311015 -0.729954
C  1.05974 1.157854 0.013288
C  -0.382747 0.765585 -0.368831
C  -2.747715 1.612337 -0.065187
C  -3.47584 0.232866 0.212872
H  5.771544 1.738012 -0.548463
H  6.658671 0.248038 -0.989101
H  7.063117 0.735991 1.428703
H  5.308019 0.828952 1.730805
H  4.425993 0.046151 -1.975284
H  6.137654 -1.436829 2.425923
H  6.855476 -1.692845 0.809666
H  4.647313 -2.855615 0.882859
H  3.847332 -1.338066 1.440721
H  2.038347 0.480068 -1.828244
H  1.950103 -0.77189 -0.541809
H  1.213184 1.019951 1.102504
H  1.221741 2.227955 -0.20641
H  -0.52223 -0.32732 -0.184902
H  -0.547972 0.928172 -1.452179
H  -1.2045 1.636988 1.373335
H  -3.295225 2.405281 0.470744
H  -2.806582 1.819093 -1.147269
H  -2.986242 -0.569705 -0.371468
H  -3.429931 0.003462 1.2964
H  -5.067359 -3.063339 -1.025955
