program: Gaussian 09
title: 000210321
version: EM64L-G09RevD.01
frameworkgroup: C1[X(C15H20ClN5)]
method: RPBEPBE
basis: SDD
operation: Freq
keyword: #p
keyword: freq=noraman
keyword: PBEPBE/SDD
title: #p freq=noraman PBEPBE/SDD
converged: YES YES NO NO
title: Mulliken charges:
elementType: Cl N N N N N C C C C C C C C C C C C C C C H H H H H H H H H H H H H H H H H H H H
charge: -0.045963 -0.309301 -0.126891 -0.167747 -0.636997 -0.612891 0.269627 0.019403 -0.434249 -0.451723 -0.410690 -0.431126 -0.756191 0.211282 0.300214 -0.045007 -0.321938 -0.332714 -0.204742 -0.207193 -0.121487 0.188596 0.199326 0.216183 0.204640 0.197457 0.218756 0.182322 0.183632 0.228395 0.210680 0.212925 0.210182 0.263876 0.267797 0.341531 0.335190 0.320865 0.314973 0.259530 0.259469
chargesum: 0.00000
title: Mulliken charges with hydrogens summed into heavy atoms:
elementType: Cl N N N N N C C C C C C C C C C C C C C C
charge: -0.045963 -0.309301 -0.126891 -0.167747 0.039724 0.022947 0.269627 0.207999 -0.018740 -0.049626 -0.009612 -0.019100 -0.122404 0.211282 0.300214 -0.045007 -0.058061 -0.064917 0.054788 0.052276 -0.121487
polarizability: 2.85541996e+02 2.64640834e+01 1.92547190e+02 5.43426416e+00 -1.05459067e+00 1.56696773e+02
1716.lowfreq: -7.2882 -2.1334 -0.0016 -0.0013 -0.0007 14.7540 20.2835 39.2822 47.2652
frequency: 20.0631 38.9470 47.2214 68.3473 75.8572 105.3256 148.0832 171.1209 189.3056 200.3810 215.1308 220.7803 229.7355 259.4575 280.6880 301.3335 322.2081 351.8650 355.6551 372.9414 377.3364 415.6258 417.4624 421.5162 438.0463 476.6902 483.8436 493.6201 510.4157 517.8377 528.7865 531.2908 561.5927 624.0072 626.4298 657.3097 682.6956 714.5049 722.8011 733.8821 775.0980 781.4647 822.6070 831.1683 855.9375 860.6635 896.1093 930.3920 931.5672 936.0392 956.3314 966.4083 970.9341 984.0131 998.3908 1013.0020 1043.3053 1053.2668 1069.1612 1089.6192 1094.3028 1098.0535 1119.4639 1122.8654 1144.3060 1173.4153 1176.1842 1192.0199 1246.7383 1254.1915 1262.2563 1276.4374 1283.4403 1304.3511 1307.0050 1314.9592 1332.1687 1341.7968 1348.7074 1360.1209 1384.3728 1388.1285 1404.4487 1446.6387 1447.9073 1451.7846 1461.9513 1469.2938 1471.4854 1475.6691 1477.7817 1529.3705 1570.0528 1571.8254 1589.1916 1606.9745 1616.8573 2928.8491 2963.9289 2964.1288 2976.9630 2978.5615 2987.3200 3028.6264 3040.8244 3042.5165 3054.1997 3061.0231 3061.4182 3150.3849 3154.6287 3172.0413 3176.5231 3553.9130 3566.9553 3708.7571 3729.0973
redmass: 4.3153 6.6992 4.5326 3.9334 5.3034 3.3788 6.3924 4.6198 3.8816 5.1153 1.2899 3.8472 1.8600 4.8177 4.4978 2.3935 2.5027 3.8976 2.8325 1.2499 1.2075 3.1435 3.1312 1.7711 6.8093 2.9119 2.5341 2.7408 3.9445 1.2235 2.9627 1.4535 3.3325 5.8473 6.6773 4.2694 6.0484 4.1258 10.6518 5.9524 2.0810 1.6642 1.6590 1.2449 3.4706 2.7141 1.9319 2.2353 2.5882 1.4291 1.4240 2.1536 1.3663 1.6528 3.8829 1.5827 2.4252 3.2361 2.6438 1.4635 2.4648 1.3441 1.9500 2.4736 1.7184 1.1724 2.1844 2.0573 1.8736 1.4669 1.8442 2.1431 1.2809 1.3506 1.4095 1.3849 1.4794 1.4889 5.9642 1.6114 1.2209 3.5872 4.4201 3.4733 1.1887 1.0900 1.0916 1.1186 2.4324 1.0561 1.0577 2.6869 2.1259 3.9632 5.8137 2.2110 2.2996 1.0826 1.0371 1.0582 1.0605 1.0600 1.0614 1.0996 1.1009 1.1018 1.1023 1.0993 1.0992 1.0890 1.0891 1.0964 1.0976 1.0444 1.0437 1.1053 1.1058
irintensity: 0.1858 0.1856 0.2416 0.3028 0.3671 0.0230 0.0337 2.2810 4.0946 0.6260 1.0556 1.1673 1.2601 2.2720 1.3531 0.6200 16.3373 2.1394 4.7694 9.1400 358.7808 22.3838 0.2858 3.5372 11.0281 4.8885 40.2558 8.8898 28.0425 5.6862 10.0940 50.7235 9.6944 11.7202 6.0252 8.5752 0.9321 2.8845 34.0504 4.9017 2.4677 3.1466 46.1594 1.1189 72.1257 0.8137 6.1402 9.8167 1.4614 6.3931 1.7806 13.2391 0.0154 27.0591 45.7669 14.8218 28.2665 16.6464 52.0288 2.8400 4.0902 10.8623 0.9307 0.5688 5.8507 1.1275 3.0073 1.1080 24.1457 15.4468 14.2399 45.2497 1.9881 1.4440 13.5961 2.3036 5.5803 0.2966 0.5662 5.6646 18.5355 5.0285 396.6373 99.7861 18.1099 4.2585 7.4553 27.8531 156.8049 10.5430 10.8428 282.3065 138.0600 48.9815 37.3080 497.4325 619.1334 24.3725 26.5733 39.5820 52.7101 73.4376 28.7536 31.6919 13.0180 20.3199 12.5269 86.6975 54.0003 4.3626 3.9257 3.5563 0.3375 61.8918 81.9869 52.8657 35.8140
temp: 298.150 k
press: 1.00000 atm
elementType: 17 7 7 7 7 7 6 6 6 6 6 6 6 6 6 6 6 6 6 6 6 1 1 1 1 1 1 1 1 1 1 1 1 1 1 1 1 1 1 1 1
symmnumber: 1
zpe: 879810.3 jmol-1
zpe.correction: 0.335102 hartree
zpe.thermalcorrener: 0.355036 hartree
zpe.thermalcorrenthalpy: 0.355980 hartree
zpe.thermalcorrgfe: 0.286480 hartree
zpe.sumelectzpe: -1315.874933 hartree
zpe.sumelectthermal: -1315.854999 hartree
zpe.sumelectthermalent: -1315.854055 hartree
zpe.sumelectthermalfe: -1315.923555 hartree
dipole: 1.2551 -1.3081 0.5737
dipole: 1.9015
quadrupole: -135.7886 -126.9158 -126.5608
quadrupole: -2.4002 2.6589 0.8041
quadrupole: -6.0336 2.8393 3.1943 -2.4002 2.6589 0.8041
hfenergy: -1316.2100352 hartree
pointgroup: C01 [X(C15H20Cl1N5)]
dipole: 0.5295952 -0.4755586 0.2302594 debye
polarizability: 280.4802445|33.4970978|197.3806311|7.94956|0.3519625|156.9250835 unknown
InChI: InChI=1S/C15H20ClN5/c1-10-6-8-15(9-7-10)20-13(17)19-14(18)21(15)12-4-2-11(16)3-5-12/h2-5,10H,6-9,17-18H2,1H3
charge 0 multiplicity 1
41 atoms
Cl 5.694603 1.53786 0.038037
N  0.1260 -0.898679 -0.003797
N  -2.269906 -0.799221 -0.639696
N  -1.252719 -2.862085 0.215002
N  1.020994 -2.991849 0.692473
N  -3.401023 -2.852366 -0.68735
C  -1.143924 -0.012007 -0.129089
C  -2.410816 2.70281 0.231527
C  -1.474083 0.563645 1.285051
C  -0.869021 1.151801 -1.112665
C  -2.665374 1.547855 1.23173
C  -2.073969 2.11825 -1.164052
C  -3.61304 3.667939 0.16498
C  -0.07047 -2.239963 0.30503
C  1.445262 -0.322401 0.012457
C  -2.286977 -2.096482 -0.364131
C  2.17348 -0.17619 -1.197338
C  2.038676 0.099024 1.232915
C  3.465425 0.392211 -1.197148
C  3.332878 0.665559 1.247288
C  4.025198 0.805843 0.028662
H  -1.522709 3.273255 0.587055
H  -0.580636 1.096818 1.671143
H  -1.693841 -0.277308 1.970959
H  -0.675062 0.729588 -2.116135
H  0.033182 1.708859 -0.792203
H  -3.571364 0.994415 0.917061
H  -2.858608 1.956132 2.244019
H  -1.858221 2.939622 -1.875864
H  -2.952591 1.563739 -1.545412
H  -3.41852 4.507997 -0.528447
H  -4.517355 3.138474 -0.192551
H  -3.843629 4.094927 1.159521
H  1.717793 -0.509372 -2.134855
H  1.484363 -0.018073 2.169846
H  1.939516 -2.583334 0.839316
H  0.860996 -3.986181 0.83227
H  -3.363801 -3.858726 -0.557939
H  -4.203382 -2.3972 -1.111995
H  4.025192 0.509074 -2.129498
H  3.790381 0.992139 2.18562
