program: Gaussian 09
title: 000210344
version: EM64L-G09RevD.01
frameworkgroup: C1[X(C14H29NO4S2)]
method: RPBEPBE
basis: SDD
operation: Freq
keyword: #p
keyword: freq=noraman
keyword: PBEPBE/SDD
title: #p freq=noraman PBEPBE/SDD
converged: YES YES NO NO
title: Mulliken charges:
elementType: S S O O O O N C C C C C C C C C C C C C C H H H H H H H H H H H H H H H H H H H H H H H H H H H H H
charge: 0.097212 0.969641 -0.276843 -0.559072 -0.503845 -0.496306 -0.278628 -0.020266 -0.438128 -0.425059 -0.397490 -0.402774 -0.384513 -0.315166 -0.248053 -0.394762 -0.361480 -0.394900 -0.364227 -0.264709 -0.764064 0.211697 0.186331 0.194018 0.233212 0.174177 0.195884 0.193518 0.192149 0.197031 0.186988 0.198492 0.176839 0.187739 0.179655 0.178271 0.212612 0.208073 0.187778 0.190269 0.190040 0.222208 0.219258 0.198955 0.273737 0.219959 0.228932 0.308178 0.298729 0.378704
chargesum: 0.00000
title: Mulliken charges with hydrogens summed into heavy atoms:
elementType: S S O O O O N C C C C C C C C C C C C C C
charge: 0.097212 0.969641 -0.276843 -0.180368 -0.503845 -0.496306 -0.004891 0.191431 -0.057778 -0.017670 -0.008088 -0.013594 0.000967 0.049411 0.109873 0.025923 0.016567 0.017347 0.053986 0.184182 -0.157157
polarizability: 4.49179279e+02 -4.33737375e+01 2.11786549e+02 -1.19363089e+01 6.17439886e+00 1.77653013e+02
1716.lowfreq: -9.2662 -2.7742 -0.0019 -0.0013 -0.0011 3.5281 5.8877 14.6318 17.4503
frequency: -4.3340 13.3772 17.1263 24.4472 28.9643 38.0725 44.3297 56.9587 68.4552 87.0032 102.6499 109.8466 114.0558 124.0571 130.3109 141.0183 149.2499 154.3280 166.7837 183.0551 211.4095 214.6126 225.6193 238.5585 262.5135 284.9713 301.9178 308.0271 321.4848 357.4796 393.6453 402.6698 428.8965 439.7177 455.4925 483.2718 510.4860 523.9942 563.6549 603.2007 699.7710 734.5745 743.4239 768.4732 778.8648 789.4887 826.0866 840.6972 842.5358 853.6455 883.6951 905.6293 929.7490 933.5294 954.1526 961.7660 969.9923 978.1885 1006.2872 1024.7700 1043.3077 1051.1347 1055.7319 1057.6756 1060.4783 1070.1356 1080.9452 1081.8662 1101.5520 1113.1012 1117.4139 1119.7851 1141.6915 1154.6836 1159.0885 1183.7444 1185.5435 1205.0429 1227.5018 1232.0643 1247.7151 1258.6049 1259.3455 1265.0763 1268.2365 1283.4066 1285.0312 1286.8835 1289.8226 1299.0199 1312.1310 1329.3528 1335.0495 1336.0104 1340.9129 1344.5977 1348.6158 1358.9845 1365.0572 1378.3588 1403.8363 1420.1879 1451.1774 1461.8038 1463.0982 1465.1514 1466.0370 1467.8837 1470.2660 1471.7202 1476.8491 1479.2743 1482.8940 1489.1727 1493.3428 2873.1037 2892.7236 2904.4343 2914.3836 2942.5331 2944.6788 2951.0092 2953.1854 2954.5389 2956.9890 2963.8422 2964.3822 2965.7472 2966.6326 2975.9203 2991.2702 2996.7945 3001.7746 3016.0357 3023.7873 3025.2827 3027.6707 3038.3828 3039.5494 3053.2108 3054.4417 3058.7413 3452.9438 3455.8737
redmass: 5.4405 5.7585 6.3369 3.8434 4.3300 3.9630 2.2294 3.4374 3.5094 2.3312 2.5702 3.3166 3.8336 5.2883 2.6596 2.3914 2.7049 4.3825 2.7266 1.9724 3.4944 3.8187 1.8870 4.2384 5.3221 7.1952 4.8387 4.5337 1.7823 3.9618 3.4461 12.7653 2.3726 2.5688 2.9902 2.3938 3.7901 16.6594 1.9946 1.3015 4.4929 1.0690 1.2346 1.1166 2.3663 1.5347 15.2333 1.4489 1.4519 1.8728 2.3525 1.6542 9.3008 2.4372 1.2710 2.0102 1.7414 1.9122 4.8352 2.2926 3.5687 2.0798 1.7423 1.1357 1.8656 3.3901 1.4635 2.1839 2.9692 2.0410 1.6573 2.0264 1.5788 2.5147 1.9655 1.5195 1.4361 1.3553 1.2950 1.2556 1.2253 1.2655 1.2562 1.2956 1.1346 1.1231 1.1720 1.1131 1.1374 1.2668 1.2977 1.2688 1.3723 1.4250 1.4653 1.5268 1.3743 1.5580 1.5884 1.4527 1.4919 1.0782 1.2479 1.0871 1.0885 1.0898 1.0808 1.0686 1.0854 1.0836 1.0887 1.0940 1.0858 1.0818 1.0895 1.0702 1.0545 1.0544 1.0690 1.0996 1.1047 1.0670 1.0654 1.0636 1.0598 1.0608 1.0638 1.0644 1.0639 1.0833 1.0604 1.0841 1.0985 1.0982 1.0902 1.0950 1.1014 1.1023 1.1018 1.0960 1.0979 1.1041 1.0662 1.0749
irintensity: 0.1796 0.0531 0.4405 0.9496 0.7910 0.9395 0.5390 1.1400 0.0663 1.3554 1.8174 8.4499 12.3735 7.5690 1.5930 5.6515 6.0045 5.9011 2.9776 71.4549 18.9955 27.6281 3.3134 10.1563 35.9125 7.8707 5.1489 11.9644 0.8854 24.4072 12.3539 43.5694 9.7471 0.1710 13.4999 35.5822 10.3899 196.7801 9.0491 220.2649 1.4079 8.7646 11.4114 1.7924 0.1495 0.0875 91.3547 11.0348 0.2405 1.6057 19.4313 2.1313 74.9671 7.3273 8.1830 4.5072 3.6507 3.4744 9.8642 1.1563 82.3941 8.5933 56.7829 8.0919 16.9768 107.0652 7.3903 0.3964 16.8734 6.7965 5.5390 23.7589 0.3076 5.8379 8.9775 19.1215 62.4892 1.9836 33.6273 3.3055 2.3387 1.2709 7.7006 4.0260 12.5009 5.5871 0.3861 2.5801 5.1919 11.0406 1.2290 47.2950 0.1325 0.3035 0.9122 0.1323 27.1045 4.5531 0.5237 81.4173 1.2384 14.8665 38.1685 0.3367 5.5302 13.0066 3.8501 1.5690 2.5625 24.5485 3.1111 1.9623 3.7620 11.2574 13.2907 83.9382 27.5981 104.9934 35.0897 61.8364 24.7359 16.1328 42.6609 4.0545 9.5832 38.1061 41.2885 33.9378 27.2909 52.2414 29.8459 43.0704 2.4071 85.1984 22.2355 80.0958 31.5877 100.7668 16.5136 53.6577 6.2315 105.6697 82.5013 34.2872
temp: 298.150 k
press: 1.00000 atm
elementType: 16 16 8 8 8 8 7 6 6 6 6 6 6 6 6 6 6 6 6 6 6 1 1 1 1 1 1 1 1 1 1 1 1 1 1 1 1 1 1 1 1 1 1 1 1 1 1 1 1 1
symmnumber: 1
zpe: 1104561.7 jmol-1
zpe.correction: 0.420705 hartree
zpe.thermalcorrener: 0.446949 hartree
zpe.thermalcorrenthalpy: 0.447893 hartree
zpe.thermalcorrgfe: 0.358976 hartree
zpe.sumelectzpe: -1700.725859 hartree
zpe.sumelectthermal: -1700.699616 hartree
zpe.sumelectthermalent: -1700.698672 hartree
zpe.sumelectthermalfe: -1700.787589 hartree
dipole: 4.7800 -2.1766 2.0014
dipole: 5.6206
quadrupole: -187.7082 -146.7319 -142.4597
quadrupole: 3.2036 -6.1494 3.8057
quadrupole: -28.7416 12.2347 16.5069 3.2036 -6.1494 3.8057
hfenergy: -1701.1465646 hartree
pointgroup: C01 [X(C14H29N1O4S2)]
dipole: -1.8795489 1.0860941 0.4214861 debye
polarizability: 448.4068491|-37.3464525|203.8500988|28.5079759|-16.2891827|186.3618927 unknown
InChI: InChI=1S/C14H28NOS.HO3S/c17-12-10-15-9-5-2-6-11-16-13-14-7-3-1-4-8-14;1-4(2)3/h14-15H,1-13H2;1H
charge 0 multiplicity 1
50 atoms
S  7.56521 0.798712 -0.96898
S  8.326032 -0.962895 0.612528
O  -3.982303 0.429274 -0.230459
O  8.355675 0.107693 2.13678
O  7.09691 -2.017067 0.759804
O  9.822967 -1.54081 0.405208
N  3.48734 0.300152 -0.520551
C  -6.399695 0.120089 -0.173444
C  -7.762804 0.783652 0.154934
C  -6.285891 -1.263074 0.515021
C  -8.94948 -0.136998 -0.219502
C  -7.468525 -2.185488 0.13782
C  -8.827918 -1.520884 0.462756
C  -5.239052 1.045028 0.217611
C  -2.801836 1.208393 0.151199
C  -1.564378 0.448587 -0.337888
C  -0.244325 1.161525 0.032834
C  1.000573 0.386046 -0.452464
C  2.321409 1.073296 -0.055565
C  4.823067 0.852293 -0.267069
C  5.842522 0.095083 -1.137896
H  -6.342784 -0.03586 -1.271912
H  -7.805605 1.005944 1.242893
H  -7.852851 1.753544 -0.374912
H  -5.320812 -1.728049 0.24431
H  -6.276299 -1.112706 1.616606
H  -9.906355 0.346039 0.059138
H  -8.968107 -0.275663 -1.320458
H  -7.423647 -2.410298 -0.948275
H  -7.379446 -3.154015 0.667521
H  -8.917241 -1.39401 1.562046
H  -9.66287 -2.176448 0.146836
H  -5.215059 1.189889 1.323622
H  -5.357197 2.046079 -0.258083
H  -2.848149 2.223925 -0.306594
H  -2.770992 1.336756 1.258334
H  -1.635342 0.324156 -1.435622
H  -1.581911 -0.568033 0.100592
H  -0.190882 1.292404 1.133939
H  -0.235852 2.181214 -0.405484
H  0.977711 -0.639078 -0.025478
H  0.971795 0.272695 -1.553347
H  2.373708 2.080852 -0.514763
H  2.338991 1.227558 1.051915
H  3.413867 -0.708184 -0.332857
H  4.812128 1.923913 -0.543988
H  5.143668 0.795489 0.799329
H  5.899079 -0.96953 -0.826302
H  5.575251 0.124342 -2.21043
H  8.970704 -0.336532 2.794047
