program: Gaussian 09
title: 000210303
version: EM64L-G09RevD.01
frameworkgroup: C1[X(C14H23NO4S2)]
method: RPBEPBE
basis: SDD
operation: Freq
keyword: #p
keyword: freq=noraman
keyword: PBEPBE/SDD
title: #p freq=noraman PBEPBE/SDD
converged: YES YES NO NO
title: Mulliken charges:
elementType: S S O O O O N C C C C C C C C C C C C C C H H H H H H H H H H H H H H H H H H H H H H H
charge: 0.094168 0.973716 -0.270863 -0.554240 -0.503647 -0.500796 -0.280359 -0.365246 -0.369760 -0.395151 -0.405685 -0.367983 -0.314535 -0.266152 -0.760761 0.369152 -0.351444 -0.381132 -0.223113 -0.197178 -0.257655 0.195060 0.196682 0.191972 0.193731 0.189384 0.219673 0.215958 0.216054 0.201532 0.219086 0.205700 0.205249 0.273569 0.220882 0.220476 0.299296 0.312156 0.246802 0.249301 0.222295 0.226602 0.227327 0.379875
chargesum: 0.00000
title: Mulliken charges with hydrogens summed into heavy atoms:
elementType: S S O O O O N C C C C C C C C C C C C C C
charge: 0.094168 0.973716 -0.270863 -0.174364 -0.503647 -0.500796 -0.006790 0.026496 0.015943 0.013906 0.026328 0.052635 0.096415 0.175206 -0.149309 0.369152 -0.104642 -0.131831 -0.000818 0.029424 -0.030328
polarizability: 4.97179709e+02 -1.81321282e+01 1.90235120e+02 -1.45420334e+01 -6.18279466e+00 1.62966156e+02
1716.lowfreq: 0.0011 0.0017 0.0023 1.1334 1.8496 7.8769 11.7088 12.5539 18.6594
frequency: 11.1783 12.4746 18.3694 22.6962 30.8889 40.9690 54.1999 65.1116 72.7394 78.7685 105.4180 110.4195 123.3648 132.0098 144.1199 152.4860 155.6210 167.6551 184.2887 209.0081 219.5790 233.4863 234.9253 262.6513 282.6200 305.4563 328.0071 377.5003 403.5393 412.1288 425.0499 478.6088 499.4458 503.9151 527.9713 583.4897 597.0553 610.5390 692.8650 698.2173 730.6853 749.0212 754.6532 759.1901 788.2910 806.3419 824.8817 827.3854 883.7011 891.9323 924.5447 960.7577 965.0747 979.1167 981.3361 982.2072 985.8894 1005.0311 1021.1422 1023.0109 1047.2237 1052.3351 1063.4214 1079.4751 1081.0965 1084.3765 1109.4756 1120.1701 1150.7847 1160.5280 1166.8463 1178.6459 1185.5663 1218.6012 1222.3319 1227.8360 1256.2475 1270.7192 1280.3963 1285.6561 1290.5114 1293.5982 1297.0511 1314.1393 1322.7678 1345.2262 1362.1487 1378.4772 1380.5867 1393.7499 1422.2691 1443.3655 1455.4674 1464.5213 1466.0614 1469.9372 1473.9514 1478.3915 1483.5085 1489.4794 1492.4999 1591.1203 1612.0506 2877.0686 2912.7850 2942.0185 2952.6399 2956.6509 2959.7361 2968.0487 2994.4370 2995.7814 2998.2314 2998.9442 3018.6089 3025.0340 3045.3572 3058.7013 3062.8915 3127.3197 3136.0995 3155.2719 3163.8891 3172.5808 3452.5077 3464.4965
redmass: 5.8212 5.4834 5.7660 5.4623 7.5263 4.9476 3.1121 2.7343 3.4275 3.5587 2.4054 3.3836 2.1909 4.3648 2.6304 3.7407 2.4531 3.2304 1.6265 3.2840 4.2323 5.0618 7.6107 7.2158 5.8206 5.7392 4.2047 3.9668 13.9209 2.9348 4.3279 3.3120 3.9496 2.8548 17.2869 5.1563 1.3472 6.3713 2.0264 4.0985 1.0678 1.2784 1.1722 1.5331 6.3014 1.1711 1.2539 12.9326 1.2784 1.3805 7.3374 1.3582 5.5565 2.2239 1.3743 1.3185 4.2240 4.2561 2.3547 2.1446 3.8421 2.7508 1.2662 2.0627 2.2767 1.8060 3.0814 1.2943 1.4109 3.2009 1.0809 1.1704 1.4747 3.3877 1.3502 1.2537 1.2558 1.2173 1.0623 1.2582 1.1072 1.1130 1.1232 1.3357 1.2806 1.3817 1.5935 2.0009 1.6094 2.5261 1.0731 2.3664 1.2532 1.0763 1.0732 1.1393 1.3968 1.2342 1.1666 1.1135 1.1465 6.4353 6.2450 1.0700 1.0693 1.0551 1.0647 1.0590 1.0619 1.0615 1.0602 1.0964 1.1055 1.0870 1.1019 1.0900 1.1033 1.0970 1.1048 1.0847 1.0890 1.0926 1.0950 1.1004 1.0661 1.0751
irintensity: 0.5939 0.4298 0.4949 0.8556 0.4591 0.8523 1.2760 1.1146 2.8379 23.8255 2.0333 1.2404 1.0773 5.8069 2.9682 6.7948 6.8060 11.2796 74.1516 43.0432 1.2646 0.5523 15.4619 26.7967 1.4033 8.1681 4.9178 42.8650 47.4446 0.0529 9.9414 54.8523 1.3818 11.9951 260.4214 3.0974 210.8684 0.6186 35.3434 1.4311 11.9906 9.7755 15.2762 74.8982 23.8877 3.4054 1.1078 68.6768 7.1024 7.4099 73.3192 0.2961 46.7688 6.3366 2.4741 1.9222 8.4824 12.7997 1.5354 37.6613 4.0016 16.4206 46.9032 4.9992 2.6175 8.6054 2.4155 49.2833 2.3942 19.6232 10.3917 46.3248 74.5920 285.1978 16.5161 17.9738 4.9151 23.1399 1.4119 1.6341 5.9350 11.5423 3.0507 0.8133 19.3303 0.6155 0.2047 11.9735 75.6901 40.6244 13.0768 2.5335 39.8095 3.2552 0.3529 13.7658 80.8729 34.4308 5.9804 20.9169 8.8922 27.4336 91.1451 86.5624 45.7443 30.0326 3.7509 5.5302 1.8858 73.5500 31.6495 5.6520 31.3239 28.0652 1.9209 20.1823 53.2570 9.3087 106.5549 3.4589 12.4495 35.7211 25.0492 5.4497 108.8030 41.4454
temp: 298.150 k
press: 1.00000 atm
elementType: 16 16 8 8 8 8 7 6 6 6 6 6 6 6 6 6 6 6 6 6 6 1 1 1 1 1 1 1 1 1 1 1 1 1 1 1 1 1 1 1 1 1 1 1
symmnumber: 1
zpe: 925997.8 jmol-1
zpe.correction: 0.352694 hartree
zpe.thermalcorrener: 0.378406 hartree
zpe.thermalcorrenthalpy: 0.379351 hartree
zpe.thermalcorrgfe: 0.289926 hartree
zpe.sumelectzpe: -1697.206815 hartree
zpe.sumelectthermal: -1697.181102 hartree
zpe.sumelectthermalent: -1697.180158 hartree
zpe.sumelectthermalfe: -1697.269582 hartree
dipole: 2.9563 0.5339 -1.2025
dipole: 3.2359
quadrupole: -177.2327 -141.5130 -150.6154
quadrupole: 3.9563 3.2699 -0.5905
quadrupole: -20.7790 14.9407 5.8383 3.9563 3.2699 -0.5905
hfenergy: -1697.5595084 hartree
pointgroup: C01[X(C14H23N1O4S2)]
dipole: -1.1506562 -0.4071941 -0.3618295 debye
polarizability: 496.7439518|-4.9584329|189.9622134|25.9229981|-5.8803372|163.6748187 unknown
InChI: InChI=1S/C14H22NOS.HO3S/c17-13-11-15-10-6-1-2-7-12-16-14-8-4-3-5-9-14;1-4(2)3/h3-5,8-9,15H,1-2,6-7,10-13H2;1H
charge 0 multiplicity 1
44 atoms
S  7.465822 0.630524 -1.243752
S  8.598052 0.085562 0.902519
O  -5.279981 0.749525 0.036765
O  9.915279 -1.055864 0.252908
O  9.362883 1.312987 1.630948
O  7.543992 -0.802263 1.761494
N  3.506571 0.147019 -0.164572
C  -0.298126 0.845901 -0.069257
C  -1.55366 -0.053766 -0.024666
C  1.018799 0.038575 -0.090869
C  -2.866702 0.761581 -0.0115
C  2.265729 0.942326 -0.153169
C  -4.10434 -0.137773 0.03133
C  4.778279 0.846497 -0.369579
C  5.850396 -0.18395 -0.778192
C  -6.5531 0.156585 0.081886
C  -6.78632 -1.24129 0.121212
C  -7.643429 1.063054 0.086451
C  -8.117416 -1.719626 0.165566
C  -8.962017 0.570355 0.13065
C  -9.209286 -0.82484 0.170685
H  -0.34713 1.494936 -0.967987
H  -0.304094 1.525425 0.80781
H  -1.507433 -0.701407 0.875779
H  -1.545424 -0.734463 -0.901286
H  1.07057 -0.599346 0.817054
H  1.031495 -0.645503 -0.961467
H  -2.923408 1.40323 -0.91169
H  -2.885927 1.436503 0.865593
H  2.240482 1.666666 0.698092
H  2.241182 1.547182 -1.081566
H  -4.142036 -0.804003 -0.856619
H  -4.106032 -0.767979 0.946011
H  3.541042 -0.58098 0.560033
H  5.137823 1.411655 0.52175
H  4.637301 1.584233 -1.18271
H  5.525169 -0.794646 -1.639979
H  6.070882 -0.871687 0.065951
H  -5.956887 -1.954531 0.117759
H  -7.433061 2.136662 0.055372
H  -8.294967 -2.800789 0.196095
H  -9.800067 1.27641 0.133985
H  -10.235867 -1.204177 0.205099
H  10.728462 -0.90821 0.822666
