program: Gaussian 09
title: 000210284
version: EM64L-G09RevD.01
frameworkgroup: C1[X(C14H29NO3S2)]
method: RPBEPBE
basis: SDD
operation: Freq
keyword: #p
keyword: freq=noraman
keyword: PBEPBE/SDD
title: #p freq=noraman PBEPBE/SDD
converged: YES YES NO NO
title: Mulliken charges:
elementType: S S O O O N C C C C C C C C C C C C C C H H H H H H H H H H H H H H H H H H H H H H H H H H H H H
charge: 0.094959 0.970240 -0.560822 -0.496804 -0.504728 -0.280133 0.009910 -0.485208 -0.492660 -0.433435 -0.426120 -0.441904 -0.390769 -0.383136 -0.384741 -0.370315 -0.399079 -0.368427 -0.266949 -0.760854 0.204800 0.189987 0.225536 0.221958 0.195271 0.205022 0.213173 0.216179 0.203629 0.199285 0.193488 0.191812 0.208190 0.194844 0.191969 0.195583 0.194818 0.192025 0.194431 0.190352 0.219121 0.201094 0.218916 0.273708 0.219576 0.230643 0.297015 0.310432 0.378117
chargesum: 0.00000
title: Mulliken charges with hydrogens summed into heavy atoms:
elementType: S S O O O N C C C C C C C C C C C C C C
charge: 0.094959 0.970240 -0.182704 -0.496804 -0.504728 -0.006426 0.214710 -0.069685 -0.075431 -0.015240 -0.006312 -0.049131 0.009233 0.003677 0.005660 0.016141 0.010394 0.051583 0.183270 -0.153406
polarizability: 4.54823906e+02 2.89248993e+01 1.97708775e+02 8.09705572e+00 3.23494355e+00 1.73378783e+02
1716.lowfreq: -27.9715 -14.8276 -12.3059 -3.0360 -0.0016 -0.0004 0.0008 3.8205 11.1421
frequency: -27.9082 -14.7209 10.8933 14.6863 18.5528 28.6245 39.0564 48.1249 58.2932 71.2304 93.9684 104.7958 107.5463 111.2355 123.4515 136.3352 138.9739 151.5228 153.5383 176.6671 182.4801 208.1967 217.3507 236.9654 261.4779 286.1791 302.9943 312.8762 360.2843 400.5251 401.5171 422.1414 474.5394 492.6496 521.6374 575.3080 596.5997 619.8080 699.6824 719.0813 729.5445 748.3241 750.9891 761.8129 802.8919 812.8833 826.5720 857.5890 882.7594 895.5019 931.4131 942.4399 952.3477 965.5225 973.6264 987.9030 995.8121 1002.4342 1032.9313 1038.9637 1046.9363 1053.8228 1057.5125 1064.3207 1074.1728 1081.3657 1091.4521 1110.5788 1118.1424 1125.3348 1156.5089 1174.8268 1176.8596 1185.0194 1201.8349 1208.8678 1222.2705 1228.0467 1243.7227 1254.3019 1261.3970 1271.9511 1274.3037 1278.5310 1286.1528 1288.8339 1290.9122 1291.2964 1294.9254 1299.1786 1303.7945 1313.1583 1328.4990 1340.2649 1348.2587 1355.8874 1357.5626 1378.0461 1423.5775 1455.5006 1457.5753 1460.8881 1462.8363 1463.6739 1466.7943 1471.4988 1472.6235 1474.8888 1480.6835 1485.6546 1490.2093 1491.0824 2874.4404 2916.1927 2941.3929 2946.1005 2950.0087 2952.4449 2953.5325 2956.2816 2961.1394 2966.4659 2970.5925 2977.7050 2984.6466 2990.9164 2991.3438 2995.5954 3000.5480 3008.3109 3018.4889 3024.5176 3034.1812 3036.2803 3046.1853 3049.4701 3053.9818 3054.2203 3075.0063 3454.6330 3464.2892
redmass: 1.6026 5.4905 4.7003 3.3925 5.1960 5.4345 3.4827 2.0934 3.5182 3.2646 2.0497 2.9228 2.3986 3.3627 5.2037 2.3260 1.9803 2.6801 4.1626 2.1338 2.3877 4.0265 3.2172 4.7309 4.8712 7.0920 6.4818 4.1764 3.1996 4.1659 7.3337 2.2893 2.6536 3.5332 16.9231 2.6111 1.3120 2.6800 4.4418 1.0658 1.1008 1.2348 1.2220 1.1742 1.4148 1.3748 15.3784 2.5077 1.8443 1.7979 9.4880 1.6928 1.7692 1.3731 2.1576 1.3536 4.5314 2.2330 2.5330 3.0989 1.6768 1.2655 2.1320 2.9182 2.4514 2.1005 2.6797 1.8136 1.4237 2.1339 3.4733 1.4921 1.5364 1.4342 1.4731 1.2766 1.3925 1.2898 1.2838 1.2515 1.2608 1.2784 1.1892 1.0756 1.1655 1.1702 1.1250 1.1280 1.2304 1.3137 1.2484 1.3530 1.3515 1.4617 1.5490 1.7057 1.6126 1.4348 1.0749 1.2520 1.0789 1.0718 1.0775 1.0735 1.0797 1.0857 1.0847 1.0913 1.0928 1.0924 1.0891 1.0988 1.0701 1.0691 1.0774 1.0636 1.0591 1.0592 1.0637 1.0607 1.0619 1.0610 1.0633 1.0638 1.0956 1.0960 1.0627 1.0855 1.1011 1.0659 1.1033 1.0902 1.1018 1.1003 1.1036 1.0996 1.1018 1.0978 1.1046 1.0660 1.0750
irintensity: 0.0095 0.1282 0.1361 0.4640 0.4212 1.0755 0.4685 0.2488 1.2987 0.2202 0.4987 10.5396 0.6901 17.0527 6.6788 3.6476 0.1141 4.2454 4.2860 35.7407 35.3188 44.2182 2.3543 10.4929 28.4423 11.7930 11.7481 4.8855 27.2121 16.1607 27.8784 19.2055 53.7572 6.4751 188.3326 11.0097 200.3936 0.5386 1.4608 12.4229 0.8198 9.9785 1.3068 8.8116 1.6198 0.4490 95.1288 3.8055 9.7426 0.6101 75.6620 5.1316 6.4464 1.3253 2.1536 2.2426 0.9849 4.4156 1.9983 1.3454 6.4029 46.5920 9.2348 1.2739 2.6626 0.1339 0.8122 3.3744 30.6376 7.2573 9.6566 3.7308 17.0549 48.5779 29.7417 6.2164 26.7972 1.5979 2.5364 9.8364 4.3317 3.0013 8.4974 0.3886 0.0992 0.7254 0.8051 14.3259 1.5262 2.0780 9.0706 2.0818 8.2177 6.8107 0.2363 0.2729 0.2413 85.5242 14.4972 37.2957 0.3133 0.0837 1.1749 0.8247 3.0518 7.7225 6.3984 3.6299 4.8760 7.2420 26.4743 2.2439 81.7746 34.0411 5.5325 10.1299 1.6902 2.4041 3.9797 0.8246 14.9415 145.9693 33.8677 71.0841 3.0751 8.6648 33.8491 34.5098 2.2052 67.0320 3.6143 22.0101 16.9785 50.9273 185.3745 21.6458 19.8924 8.4850 123.4803 70.7560 43.0084
temp: 298.150 k
press: 1.00000 atm
elementType: 16 16 8 8 8 7 6 6 6 6 6 6 6 6 6 6 6 6 6 6 1 1 1 1 1 1 1 1 1 1 1 1 1 1 1 1 1 1 1 1 1 1 1 1 1 1 1 1 1
symmnumber: 1
zpe: 1091097.8 jmol-1
zpe.correction: 0.415577 hartree
zpe.thermalcorrener: 0.440562 hartree
zpe.thermalcorrenthalpy: 0.441506 hartree
zpe.thermalcorrgfe: 0.354532 hartree
zpe.sumelectzpe: -1625.595588 hartree
zpe.sumelectthermal: -1625.570604 hartree
zpe.sumelectthermalent: -1625.569659 hartree
zpe.sumelectthermalfe: -1625.656634 hartree
dipole: -5.3130 -0.7611 1.1470
dipole: 5.4884
quadrupole: -189.0756 -142.1312 -138.2482
quadrupole: -2.9240 12.1970 5.0711
quadrupole: -32.5906 14.3538 18.2368 -2.9240 12.1970 5.0711
hfenergy: -1626.0111655 hartree
pointgroup: C01 [X(C14H29N1O3S2)]
dipole: -2.0925487 -0.4575965 0.2728475 debye
polarizability: 455.2539978|20.2881603|189.7582921|19.4998336|11.5427951|180.899174 unknown
InChI: InChI=1S/C14H28NS.HO3S/c16-13-12-15-11-7-3-1-2-4-8-14-9-5-6-10-14;1-4(2)3/h14-15H,1-13H2;1H
charge 0 multiplicity 1
49 atoms
S  7.157418 -1.032886 -1.165234
S  8.253128 0.577966 0.380229
O  8.140669 -0.478239 1.912923
O  9.819386 0.88733 0.119804
O  7.230025 1.8285 0.562259
N  3.194398 -0.128377 -0.431059
C  -7.047509 0.006294 -0.206444
C  -7.313877 1.338732 0.545121
C  -8.333516 -0.806383 0.102382
C  -8.8279 1.626427 0.323363
C  -9.491928 0.231614 0.042508
C  -5.742504 -0.718132 0.18741
C  -4.45353 0.051945 -0.181848
C  -3.164024 -0.725067 0.166128
C  -1.871392 0.02347 -0.229792
C  -0.585314 -0.759395 0.118211
C  0.704849 -0.032761 -0.323261
C  1.979075 -0.825078 0.027992
C  4.483787 -0.808043 -0.266924
C  5.522441 -0.129098 -1.180649
H  -7.020055 0.219339 -1.297956
H  -7.103647 1.186666 1.623832
H  -6.672991 2.169288 0.198569
H  -8.481379 -1.65201 -0.59418
H  -8.249907 -1.231727 1.123257
H  -9.278247 2.132507 1.196278
H  -8.967992 2.298707 -0.543488
H  -9.963556 0.225763 -0.95761
H  -10.287224 -0.002708 0.772804
H  -5.716845 -1.713676 -0.303976
H  -5.755876 -0.911074 1.281625
H  -4.462419 0.276985 -1.269329
H  -4.442575 1.030746 0.339323
H  -3.147407 -0.93799 1.255701
H  -3.184483 -1.711934 -0.342314
H  -1.849226 1.011658 0.27532
H  -1.889587 0.231566 -1.319997
H  -0.626072 -1.758072 -0.364702
H  -0.553556 -0.943033 1.212431
H  0.745697 0.966546 0.160008
H  0.684735 0.14261 -1.416523
H  2.000837 -1.020874 1.128642
H  1.949225 -1.816558 -0.466806
H  3.214717 0.872085 -0.19637
H  4.354535 -1.865206 -0.567986
H  4.868312 -0.814253 0.779386
H  5.178641 -0.08077 -2.230543
H  5.725575 0.907963 -0.838175
H  8.819291 -0.126158 2.563262
