program: Gaussian 09
title: 000210288
version: EM64L-G09RevD.01
frameworkgroup: C1[X(C14H29NO3S2)]
method: RPBEPBE
basis: SDD
operation: Freq
keyword: #p
keyword: freq=noraman
keyword: PBEPBE/SDD
title: #p freq=noraman PBEPBE/SDD
converged: NO YES NO NO
title: Mulliken charges:
elementType: S S O O O N C C C C C C C C C C C C C C H H H H H H H H H H H H H H H H H H H H H H H H H H H H H
charge: 0.703632 -0.077680 -0.349108 -0.552877 -0.498217 -0.272823 -0.030844 -0.008441 -0.498300 -0.009905 -0.450075 -0.426498 -0.468345 -0.779302 -0.382860 -0.744945 -0.386743 -0.381919 -0.411514 -0.239059 0.183729 0.191781 0.193014 0.199929 0.209181 0.199688 0.193701 0.186926 0.197877 0.208764 0.207054 0.214961 0.212187 0.214466 0.204336 0.190604 0.213561 0.211974 0.207811 0.185690 0.221430 0.221380 0.203436 0.277413 0.240689 0.248720 0.240439 0.213039 0.372041
chargesum: 0.00000
title: Mulliken charges with hydrogens summed into heavy atoms:
elementType: S S O O O N C C C C C C C C C C C C C C
charge: 0.703632 -0.077680 -0.349108 -0.180835 -0.498217 0.004589 0.152885 0.183340 -0.105356 0.199276 -0.056686 -0.041695 -0.052527 -0.137688 0.012080 -0.111599 0.020377 0.042898 0.077895 0.214419
polarizability: 4.44009115e+02 5.57924323e+01 2.05907532e+02 3.54182141e+01 2.27587205e+00 1.88292547e+02
1716.lowfreq: -13.6973 -10.0014 -8.9633 -3.5927 -0.0015 0.0012 0.0017 4.0658 14.0871
frequency: -10.7535 -6.3840 12.9857 25.4002 36.6468 45.0726 58.4675 69.1731 88.4320 96.6900 100.1385 105.2585 116.0583 142.7756 162.7627 169.1387 185.2636 198.4086 212.3880 213.6542 223.9579 245.7018 255.1817 262.7143 276.1557 299.9515 311.3171 335.7216 344.1326 365.8522 396.6751 417.6394 431.9562 449.5487 471.1853 489.6918 533.5974 539.4507 541.4262 560.7052 609.1973 731.1602 739.9641 783.8264 795.5541 810.7021 834.7153 844.8156 869.0786 881.0199 905.5701 919.0337 935.3067 945.1759 952.4867 976.0539 996.6961 999.3870 1019.1109 1033.7421 1036.4016 1047.8714 1051.4025 1061.4366 1076.8277 1081.9298 1099.1122 1102.8376 1112.6496 1150.3943 1152.3031 1166.7585 1179.7616 1197.6632 1206.4815 1232.1215 1235.9936 1245.5835 1254.1162 1274.0470 1276.4941 1284.0199 1294.9976 1301.9143 1305.4891 1307.8417 1311.8458 1317.6063 1327.0229 1332.7373 1336.9486 1345.4027 1349.7170 1363.2485 1364.2288 1367.1033 1384.7345 1386.6564 1455.7815 1457.8224 1458.6778 1462.9202 1464.7489 1468.2724 1472.1933 1473.7269 1474.1578 1477.1417 1479.1981 1482.3113 1484.3954 1488.9825 2886.6320 2929.4863 2940.0023 2947.4649 2954.3581 2957.4993 2961.3182 2962.6815 2964.8828 2966.2509 2968.9590 2971.7282 2972.8569 3001.8978 3008.2022 3013.3158 3020.7656 3024.4416 3028.2109 3029.4743 3044.1815 3048.8272 3058.7058 3060.5687 3062.6058 3062.9330 3103.7923 3461.2919 3492.1646
redmass: 5.5144 7.3719 5.6692 4.7425 2.2616 3.5172 5.7513 3.5707 2.1329 2.5448 2.5620 2.4530 2.5086 3.9187 2.8641 4.8268 2.6649 1.6341 2.5313 1.8383 1.4129 1.7057 4.3698 2.4786 5.1418 2.7976 4.4512 2.3426 3.4144 3.5762 2.7292 2.6358 1.9774 7.9998 7.3203 2.5534 2.3817 5.6268 2.6207 2.4615 2.2661 1.1857 2.4308 1.2923 1.7965 1.1764 1.8193 1.7473 7.0330 8.0419 1.5507 1.3308 1.8637 1.6324 2.0973 2.0004 1.3662 5.2379 2.6337 2.0076 1.2401 2.5865 1.6943 1.8751 2.1392 1.7995 1.4520 1.5990 2.9130 1.9929 1.6574 1.9650 2.9493 1.5922 1.5320 1.4158 1.2485 1.3125 1.2777 1.3744 1.2144 1.0739 1.1816 1.2830 1.3729 1.2096 1.2168 1.2085 1.4170 1.1642 1.4627 1.6828 1.4843 1.4734 1.5187 1.4247 1.2175 1.2206 1.1056 1.2234 1.1033 1.0696 1.0832 1.0753 1.0808 1.0616 1.0554 1.0611 1.0790 1.0820 1.0581 1.0917 1.0695 1.0809 1.0791 1.0737 1.0680 1.0610 1.0641 1.0475 1.0557 1.0423 1.0595 1.0533 1.0579 1.0952 1.0879 1.0972 1.0977 1.1021 1.0589 1.1011 1.1084 1.1027 1.0990 1.0991 1.0987 1.0992 1.1083 1.0662 1.0757
irintensity: 0.2056 0.7028 0.5431 0.2696 0.3396 1.6063 2.2652 3.7825 43.8411 1.9557 0.5320 26.2557 0.9570 9.2328 1.9048 10.9330 11.9409 11.1029 4.8760 3.1751 3.3254 0.2036 13.7640 2.5049 11.1810 4.3514 7.1173 1.2205 35.6121 2.9928 0.5778 55.3920 12.6197 67.0275 65.6685 6.3624 229.0614 40.3694 125.1747 40.5622 3.7764 6.9013 1.0886 8.1443 0.3167 3.9838 1.5345 1.7620 222.4528 73.9938 2.1864 2.9543 1.8296 2.4869 0.4362 6.5667 12.3317 11.0434 1.7069 8.4460 61.7561 2.8811 4.6400 4.2613 2.3344 0.3865 36.1548 15.1283 1.9101 2.0336 19.9231 10.2482 28.6276 1.6882 8.0558 3.6892 11.5899 3.1660 0.8005 2.2261 1.5049 3.3920 6.2080 1.0993 3.7850 0.1644 9.3348 1.4893 12.5026 24.4887 1.3925 1.0275 2.8728 29.8331 5.9628 1.9743 2.2118 21.7628 35.0540 11.6808 7.9230 3.9101 6.9711 9.4282 7.4287 1.0598 39.3377 9.1816 6.8303 13.4649 13.3581 20.6560 43.2867 25.4366 17.3401 1.4933 38.9742 7.0174 21.2768 24.0005 40.9710 46.8220 44.3544 30.1745 103.5761 4.1998 18.0904 94.0578 10.5464 35.1742 38.7885 50.3061 14.5254 108.8522 68.4401 40.1847 67.2663 66.6578 25.1227 47.5779 65.1322
temp: 298.150 k
press: 1.00000 atm
elementType: 16 16 8 8 8 7 6 6 6 6 6 6 6 6 6 6 6 6 6 6 1 1 1 1 1 1 1 1 1 1 1 1 1 1 1 1 1 1 1 1 1 1 1 1 1 1 1 1 1
symmnumber: 1
zpe: 1093407.2 jmol-1
zpe.correction: 0.416457 hartree
zpe.thermalcorrener: 0.440877 hartree
zpe.thermalcorrenthalpy: 0.441822 hartree
zpe.thermalcorrgfe: 0.359690 hartree
zpe.sumelectzpe: -1625.599089 hartree
zpe.sumelectthermal: -1625.574668 hartree
zpe.sumelectthermalent: -1625.573724 hartree
zpe.sumelectthermalfe: -1625.655856 hartree
dipole: -6.2816 -1.5844 0.4987
dipole: 6.4975
quadrupole: -183.7403 -143.1452 -136.5667
quadrupole: -1.3134 2.3630 3.3555
quadrupole: -29.2562 11.3389 17.9174 -1.3134 2.3630 3.3555
hfenergy: -1626.0155456 hartree
pointgroup: C01[X(C14H29N1O3S2)]
dipole: 2.4199968 -0.6171462 0.5454572 debye
polarizability: 428.6005942|-16.9266617|195.2191103|86.9780649|-11.5265831|214.3894897 unknown
InChI: InChI=1S/C14H29NO3S2/c1-12-6-7-13(2)14(11-12)5-3-4-8-15-9-10-18-20(16,17)19/h12-16H,3-11H2,1-2H3
charge 0 multiplicity 1
49 atoms
S  -6.741816 -0.192148 -1.279412
S  -8.382378 1.097277 -1.685323
O  -5.486817 0.694587 -0.116111
O  -5.548102 -0.296595 -2.738872
O  -6.958669 -1.73568 -0.831134
N  -2.155249 0.293774 1.471894
C  3.896747 -0.985104 -0.276718
C  5.250094 -1.345355 0.420916
C  4.160103 0.11365 -1.345948
C  4.819772 1.392809 -0.767159
C  5.922528 -0.084546 1.025779
C  6.135238 1.019533 -0.036113
C  2.768103 -0.608244 0.725015
C  5.130239 -2.48009 1.461954
C  1.387819 -0.374875 0.067521
C  5.067249 2.442715 -1.871339
C  0.266539 -0.161698 1.11024
C  -1.108183 0.087831 0.456153
C  -3.42014 0.899808 1.09218
C  -4.290236 -0.062666 0.180955
H  3.551984 -1.897965 -0.812225
H  5.920573 -1.70768 -0.390661
H  4.840137 -0.303121 -2.119638
H  3.221507 0.378948 -1.870551
H  4.128722 1.837041 -0.018629
H  5.297447 0.307794 1.853947
H  6.895261 -0.366798 1.47606
H  6.868089 0.662937 -0.791516
H  6.575522 1.922568 0.432143
H  3.046735 0.293745 1.305414
H  2.660762 -1.428011 1.463442
H  6.132187 -2.826544 1.777616
H  4.585974 -3.351312 1.049602
H  4.597234 -2.147148 2.372278
H  1.427462 0.508322 -0.600601
H  1.137025 -1.244304 -0.576208
H  5.529699 3.359248 -1.45881
H  4.124294 2.733718 -2.371689
H  5.749206 2.041322 -2.6462
H  0.206642 -1.05388 1.769395
H  0.511472 0.69914 1.761815
H  -1.06521 1.000649 -0.16993
H  -1.338825 -0.760357 -0.232688
H  -2.210733 -0.444269 2.182034
H  -3.234545 1.828902 0.527021
H  -4.007566 1.149752 1.991247
H  -3.729165 -0.300373 -0.742879
H  -4.522721 -0.990355 0.741638
H  -5.750006 -1.172952 -3.183002
