program: Gaussian 09
title: 000210262
version: EM64L-G09RevD.01
frameworkgroup: C1[X(C19H25N3)]
method: RPBEPBE
basis: SDD
operation: Freq
keyword: #p
keyword: freq=noraman
keyword: PBEPBE/SDD
title: #p freq=noraman PBEPBE/SDD
converged: YES YES NO NO
title: Mulliken charges:
elementType: N N N C C C C C C C C C C C C C C C C C C C H H H H H H H H H H H H H H H H H H H H H H H H H
charge: -0.116642 -0.082738 -0.502258 -0.331242 -0.392345 -0.537019 -0.553078 -0.553631 -0.408570 -0.177595 -0.174348 0.338314 0.352433 -0.292722 -0.302116 0.226737 0.314937 -0.454126 -0.342107 -0.376912 -0.171553 -0.224840 0.275758 0.276524 0.254994 0.255409 0.273803 0.273980 0.279130 0.267207 0.281506 0.274465 0.267852 0.273956 0.281573 0.258195 0.263821 0.274525 0.274443 0.261758 0.239844 0.333481 0.265243 0.262588 0.267968 0.261130 0.262269
chargesum: 2.00000
title: Mulliken charges with hydrogens summed into heavy atoms:
elementType: N N N C C C C C C C C C C C C C C C C C C C
charge: -0.116642 -0.082738 -0.168777 0.221040 0.118058 0.289894 0.270100 0.269750 0.113445 0.096931 0.100094 0.338314 0.352433 -0.030964 -0.062272 0.226737 0.314937 -0.188883 -0.079519 -0.108944 0.089577 0.037429
polarizability: 5.34893440e+02 -8.19822363e+00 1.98386108e+02 -6.12972198e+01 -3.39247263e+00 1.31084101e+02
1716.lowfreq: -26.2831 -5.5678 -1.1924 -0.0009 -0.0007 0.0008 11.8142 18.2914 20.9210
frequency: -12.3705 18.0878 20.4306 51.7408 63.3989 70.0160 94.3612 104.2667 123.9141 158.8212 179.0800 213.5445 247.0431 250.2776 261.5420 276.8352 291.3420 302.1360 327.3417 340.8029 386.3563 395.3721 415.6358 428.9968 431.2037 456.1094 487.7246 511.1455 511.7555 521.0061 542.3442 554.2044 595.7124 635.2742 646.3869 657.2235 711.1979 723.0305 754.3418 762.1720 766.0813 787.8340 806.0149 815.7844 832.3305 844.1660 852.4929 875.0127 881.2272 887.9193 915.0811 926.3773 929.5782 952.8976 963.3951 968.0538 1003.4491 1003.8146 1017.7729 1021.2747 1043.0574 1043.4194 1051.8849 1057.3194 1092.8352 1112.1479 1129.2622 1146.8206 1176.9618 1185.7317 1188.7263 1213.3744 1215.1124 1233.7903 1239.1774 1245.6035 1246.9721 1270.2694 1293.1668 1296.6305 1298.9465 1330.9663 1346.5383 1356.7604 1367.8372 1373.0879 1386.6140 1398.1918 1423.6499 1424.1378 1425.7418 1437.5026 1449.2872 1452.9457 1456.0617 1459.9674 1463.3389 1471.7456 1480.4599 1482.4459 1486.1620 1487.8335 1495.5780 1500.7793 1506.5301 1521.0824 1569.5554 1585.6713 1627.4402 1650.4231 3006.9483 3014.2965 3023.6720 3026.6686 3028.8630 3032.3217 3062.0785 3081.3492 3096.6197 3142.8901 3145.7220 3146.9886 3151.0014 3152.2352 3153.5940 3156.8343 3159.2819 3170.0479 3172.6597 3179.0904 3185.0902 3192.8147 3200.3270 3218.4648 3609.0957
redmass: 2.9386 5.0868 3.6965 3.3969 4.9339 2.6262 1.6701 3.1590 4.5423 4.1649 1.2406 4.7577 3.3527 1.0848 1.0935 3.6972 3.7390 4.4462 3.3186 2.1959 2.8940 2.8916 2.7786 2.2890 2.9001 2.8987 2.9522 2.0518 2.8226 1.8519 3.1993 5.4096 6.6243 3.6271 5.0115 6.8163 3.1635 4.5842 3.7495 1.2883 1.1071 4.2713 4.6027 1.2873 1.5913 1.5842 1.4292 1.5565 3.3778 5.5708 6.3506 2.3836 2.9516 1.3377 1.3489 1.3693 2.2459 1.3658 2.8144 3.4866 1.2042 2.6254 2.5157 1.5178 1.4697 1.5520 1.6477 1.4721 1.2447 1.7525 1.7359 1.5043 1.7313 1.2641 2.0335 1.8409 1.5793 1.7804 2.0341 1.1943 1.2977 1.1906 1.9510 3.6767 1.2717 1.9284 1.2628 1.9612 1.1516 2.3842 1.1464 4.1458 1.0793 1.0485 1.7109 1.1474 1.0417 1.0813 1.7467 1.9890 1.0576 1.0532 1.1476 1.0738 3.4456 4.7598 6.0426 4.9060 6.8602 5.7687 1.0599 1.0585 1.0585 1.0330 1.0324 1.0338 1.1038 1.1072 1.1071 1.1056 1.1060 1.1056 1.1055 1.0881 1.1058 1.1052 1.0901 1.0967 1.0885 1.0902 1.1004 1.0986 1.0996 1.0976 1.0806
irintensity: 0.1053 1.0828 0.1991 0.2786 1.7976 0.0521 0.1552 0.1796 0.4270 2.3087 0.1175 2.5802 0.3751 0.2462 0.1733 0.2252 0.8717 0.7093 0.0541 0.2504 1.2158 0.1544 1.3597 0.1073 3.1511 3.2026 11.2352 6.6606 5.4495 84.7929 2.2544 14.7846 26.2455 1.5738 7.9419 0.0374 0.6654 7.0279 10.3627 60.4133 8.2153 1.1426 1.3822 6.0163 128.8328 20.0032 3.0282 6.9507 57.2243 4.1686 50.0551 12.4018 14.2306 0.1724 0.1404 3.9259 5.8639 0.2324 7.9240 8.0739 0.0486 1.0245 16.6791 2.8381 1.5093 10.6000 32.0210 5.8303 185.5550 203.3152 160.7531 9.7085 8.9274 37.1166 34.1799 1.9250 4.8396 54.0892 0.9197 2.1160 11.8993 0.5597 0.2585 6.0268 120.7580 51.3550 4.1227 10.1810 18.8284 25.3271 19.2282 123.1431 3.0774 0.7300 5.9932 10.5051 2.0090 2.7864 32.3273 9.2069 46.3458 66.9859 5.3883 96.1140 52.6502 12.1496 69.8365 279.2617 480.7579 778.1207 1.5306 1.8901 31.3610 5.7382 1.4439 0.8687 0.4717 0.0849 13.2084 0.6171 0.7045 1.8339 3.3326 0.0714 0.8712 9.7795 0.3087 4.3984 0.6716 0.0390 11.7136 0.1952 0.3133 0.1940 56.0880
temp: 298.150 k
press: 1.00000 atm
elementType: 7 7 7 6 6 6 6 6 6 6 6 6 6 6 6 6 6 6 6 6 6 6 1 1 1 1 1 1 1 1 1 1 1 1 1 1 1 1 1 1 1 1 1 1 1 1 1
symmnumber: 1
zpe: 1066358.6 jmol-1
zpe.correction: 0.406155 hartree
zpe.thermalcorrener: 0.426314 hartree
zpe.thermalcorrenthalpy: 0.427258 hartree
zpe.thermalcorrgfe: 0.356040 hartree
zpe.sumelectzpe: -901.128171 hartree
zpe.sumelectthermal: -901.108012 hartree
zpe.sumelectthermalent: -901.107068 hartree
zpe.sumelectthermalfe: -901.178286 hartree
dipole: 21.7991 -1.0010 0.8178
dipole: 21.8374
quadrupole: 160.2953 -95.9971 -120.5255
quadrupole: 5.0724 7.1227 -1.2161
quadrupole: 179.0377 -77.2546 -101.7831 5.0724 7.1227 -1.2161
hfenergy: -901.5343259 hartree
pointgroup: C01 [X(C19H25N3)]
dipole: 8.5695871 0.6131219 0.0058022 debye
polarizability: 537.4368772|-40.2675991|153.596973|34.2316276|33.637816|173.3297988 unknown
InChI: InChI=1S/C19H25N3/c1-22(2,3)14-6-11-21-12-9-16(10-13-21)19-15-17-7-4-5-8-18(17)20-19/h4-5,7-10,12-13,15,20H,6,11,14H2,1-3H3
charge 2 multiplicity 1
47 atoms
N  6.554847 0.641791 -0.523896
N  1.747015 -0.733535 0.693581
N  -3.29459 0.621921 0.93785
C  5.557353 -0.235543 0.274868
C  4.061105 0.032675 0.013057
C  7.974115 0.221268 -0.11198
C  6.398467 0.425778 -2.030959
C  6.369135 2.125187 -0.196931
C  3.208574 -0.93598 0.885555
C  1.073135 -1.390951 -0.333919
C  1.031152 0.112202 1.530179
C  -1.065649 -0.348909 0.31379
C  -2.471288 -0.181574 0.116199
C  -0.284954 -1.217445 -0.533631
C  -0.330189 0.313563 1.364992
C  -4.608932 0.569184 0.47768
C  -4.630525 -0.29596 -0.688162
C  -3.301777 -0.752178 -0.89569
C  -5.774536 1.192846 0.972026
C  -5.865948 -0.528231 -1.371467
C  -6.971591 0.940965 0.276678
C  -7.0190 0.091571 -0.881767
H  5.80105 -0.068718 1.33987
H  5.81461 -1.281155 0.026472
H  3.789361 1.072179 0.270764
H  3.805171 -0.131024 -1.049393
H  8.102811 0.390573 0.967909
H  8.118458 -0.844406 -0.346124
H  8.703224 0.826257 -0.671567
H  5.417137 0.794747 -2.361106
H  7.189858 0.986638 -2.551027
H  6.49911 -0.647162 -2.255956
H  5.39074 2.467715 -0.562249
H  6.441435 2.267197 0.89226
H  7.164288 2.698559 -0.697049
H  3.435135 -0.791629 1.956723
H  3.444131 -1.986755 0.638966
H  1.667335 -2.065011 -0.955162
H  1.592303 0.595491 2.333456
H  -0.757869 -1.773041 -1.345857
H  -0.821347 0.988864 2.069612
H  -3.000727 1.144587 1.760369
H  -2.975359 -1.419156 -1.692654
H  -5.762039 1.842427 1.852328
H  -5.904625 -1.175854 -2.252552
H  -7.899151 1.405241 0.627313
H  -7.97986 -0.066313 -1.380096
