program: Gaussian 09
title: 000210266
version: EM64L-G09RevD.01
frameworkgroup: C1[X(C12H18N2O6S2)]
method: RPBEPBE
basis: SDD
operation: Freq
keyword: #p
keyword: freq=noraman
keyword: PBEPBE/SDD
title: #p freq=noraman PBEPBE/SDD
converged: YES YES NO NO
title: Mulliken charges:
elementType: S S O O O O O O N N C C C C C C C C C C C C H H H H H H H H H H H H H H H H H H
charge: 0.110527 0.969609 -0.248919 -0.557916 -0.488037 -0.498995 -0.219268 -0.218425 -0.279641 0.021491 -0.385211 -0.392226 -0.361049 -0.315595 -0.267562 -0.766785 0.364384 -0.309279 -0.343439 -0.360474 -0.333748 0.376387 0.220514 0.186343 0.218078 0.219233 0.198513 0.220427 0.214753 0.217815 0.266702 0.222597 0.230581 0.306304 0.302247 0.260227 0.263710 0.285433 0.288909 0.381785
chargesum: 0.00000
title: Mulliken charges with hydrogens summed into heavy atoms:
elementType: S S O O O O O O N N C C C C C C C C C C C C
charge: 0.110527 0.969609 -0.248919 -0.176131 -0.488037 -0.498995 -0.219268 -0.218425 -0.012939 0.021491 0.021647 0.045085 0.057891 0.116973 0.185617 -0.158234 0.364384 -0.049052 -0.079729 -0.075041 -0.044839 0.376387
polarizability: 4.93528011e+02 1.23975262e+01 1.84945955e+02 2.29602688e+01 -1.01191253e+01 1.69070623e+02
1716.lowfreq: -1.5831 -0.0024 -0.0017 -0.0015 2.3767 10.1721 15.4027 16.9086 22.7897
frequency: 11.3332 16.6196 22.4548 24.0654 30.0516 46.4585 64.9297 71.2465 79.5785 88.3032 116.8923 122.0634 126.9553 134.5655 141.1919 155.4943 161.3535 164.9634 189.8962 219.8093 223.0943 243.2136 278.5180 295.4029 298.2012 306.1462 310.1405 383.7874 403.3084 409.2341 419.4227 479.4418 488.6277 496.7362 521.2848 524.0749 622.5196 632.9092 637.9905 665.6235 700.1890 734.1853 738.4926 754.1010 757.9441 808.3038 813.8397 825.3723 829.3686 854.0505 929.2592 937.3946 958.2280 976.8275 981.8408 988.8302 994.4607 1022.4252 1037.0864 1057.9029 1069.5291 1073.0178 1096.4527 1109.2615 1112.5071 1116.0617 1148.4501 1156.7507 1170.2498 1193.2878 1226.4470 1236.3711 1240.6609 1252.0693 1274.0634 1284.4599 1291.4913 1293.3556 1295.5670 1323.2749 1352.6010 1354.4780 1382.6947 1385.1234 1404.4958 1419.5634 1436.5402 1456.2465 1469.0634 1470.5257 1477.1419 1483.5422 1488.8741 1493.4866 1588.2023 1612.9200 2874.7077 2912.7046 2957.8054 2964.3271 2968.6535 2997.2666 3002.6663 3018.3940 3026.5258 3031.9847 3056.0834 3068.7889 3166.2349 3168.5493 3185.4338 3190.1985 3439.2777 3452.8679
redmass: 7.8492 6.2489 9.1367 6.2508 8.4754 5.2521 3.1975 6.4650 3.6320 2.7091 3.2500 6.9547 2.6679 3.5092 2.2248 4.6861 4.9496 2.9182 2.0547 4.6759 6.4690 3.8572 7.6907 4.8802 6.9088 7.5168 6.1674 6.1097 11.6198 4.9579 3.0245 4.1776 5.2428 3.0439 5.9281 11.6507 6.9361 8.0272 1.2964 4.5319 5.6891 4.8507 1.1669 1.0823 8.4671 1.1902 7.2820 1.2429 13.7343 1.6449 1.2215 9.2337 7.0837 1.3347 1.9008 1.3353 2.8849 2.9854 3.0339 1.2284 2.5278 3.3236 3.1388 2.2542 1.3917 1.3310 2.5982 1.5128 1.4200 1.4295 5.1210 3.9310 1.2325 1.2535 1.2579 1.0657 1.1461 1.2763 1.1181 1.2754 1.6109 4.4454 1.4519 1.5447 5.7282 1.0903 4.4021 1.2237 1.2213 1.0766 1.4108 1.2423 1.1952 1.1065 7.7708 6.5305 1.0703 1.0696 1.0558 1.0631 1.0619 1.0650 1.0803 1.1055 1.0903 1.1008 1.0995 1.1054 1.0883 1.0892 1.0961 1.0972 1.0746 1.0660
irintensity: 1.5973 0.6229 1.0561 0.4883 1.1657 0.7960 0.4461 0.1397 0.4763 0.5851 16.7362 1.4846 12.8721 8.5838 0.9848 5.6044 5.4119 7.1556 85.9374 39.4916 3.2206 8.1054 35.3566 1.8405 0.0374 9.6892 10.8847 14.7757 41.1901 25.8295 0.0823 40.9976 1.6361 9.4401 54.6860 126.4391 7.0952 35.8284 285.7679 23.3532 5.3822 5.4843 8.8377 9.3488 0.4425 8.7075 28.0379 3.1868 88.0947 71.7702 10.1580 78.9100 121.0943 3.3775 11.0346 0.2193 1.8399 4.4624 12.8022 62.3597 4.0006 9.5273 23.4151 6.0370 19.3803 41.2929 15.8547 8.7754 304.2980 115.0006 572.4608 204.5630 21.2153 1.5215 28.7861 0.2417 2.5973 0.8514 13.9082 27.7329 19.7102 75.2537 73.0761 40.8269 54.5497 18.5167 13.4889 36.4154 41.6036 5.9066 41.3316 11.6438 11.0885 17.9932 42.5837 257.9136 93.9317 29.7805 17.5465 28.2825 2.9559 11.7921 40.9856 19.5775 23.5423 10.6166 6.3503 72.2329 6.7786 1.2871 3.1889 5.2040 36.2055 68.4630
temp: 298.150 k
press: 1.00000 atm
elementType: 16 16 8 8 8 8 8 8 7 7 6 6 6 6 6 6 6 6 6 6 6 6 1 1 1 1 1 1 1 1 1 1 1 1 1 1 1 1 1 1
symmnumber: 1
zpe: 783848.9 jmol-1
zpe.correction: 0.298552 hartree
zpe.thermalcorrener: 0.323961 hartree
zpe.thermalcorrenthalpy: 0.324906 hartree
zpe.thermalcorrgfe: 0.236958 hartree
zpe.sumelectzpe: -1823.065852 hartree
zpe.sumelectthermal: -1823.040443 hartree
zpe.sumelectthermalent: -1823.039499 hartree
zpe.sumelectthermalfe: -1823.127447 hartree
dipole: 3.5864 -2.0234 0.0054
dipole: 4.1178
quadrupole: -276.5526 -149.5224 -138.1862
quadrupole: 1.7635 5.5383 -0.3104
quadrupole: -88.4655 38.5647 49.9009 1.7635 5.5383 -0.3104
hfenergy: -1823.3644046 hartree
pointgroup: C01 [X(C12H18N2O6S2)]
dipole: -1.4111731 -0.7946899 0.0410867 debye
polarizability: 493.6373048|-11.3205578|185.9209643|22.7292212|9.299881|167.9863194 unknown
InChI: InChI=1S/C12H17N2O3S.HO3S/c15-14(16)11-3-5-12(6-4-11)17-9-2-1-7-13-8-10-18;1-4(2)3/h3-6,13H,1-2,7-10H2;1H
charge 0 multiplicity 1
40 atoms
S  -7.659689 -0.86449 1.212548
S  -8.291293 0.713892 -0.57794
O  2.51251 -0.986346 -0.385926
O  -8.0313 -0.464698 -1.994987
O  -9.837548 1.181254 -0.604227
O  -7.123457 1.84048 -0.65128
O  8.22421 1.73041 0.571206
O  8.799433 -0.102802 -0.66259
N  -3.591222 -0.251748 0.741996
N  7.925634 0.647841 -0.07278
C  -1.11288 -0.236631 0.52407
C  0.117858 -0.955944 -0.073042
C  -2.427368 -0.965817 0.182744
C  1.417202 -0.214353 0.244282
C  -4.908945 -0.875993 0.533699
C  -5.943058 -0.14342 1.402846
C  3.816241 -0.516785 -0.262434
C  4.182291 0.666341 0.436271
C  4.809332 -1.312913 -0.896911
C  5.535298 1.046276 0.496197
C  6.156657 -0.935201 -0.837296
C  6.509687 0.246055 -0.138599
H  -1.024556 -0.161702 1.625182
H  -1.160861 0.802345 0.133993
H  0.015328 -1.039368 -1.171766
H  0.187383 -1.986069 0.324883
H  -2.501649 -1.091698 -0.926009
H  -2.411925 -1.9853 0.616356
H  1.404127 0.81291 -0.174299
H  1.591526 -0.156623 1.338146
H  -3.58908 0.752543 0.515204
H  -4.843139 -1.937045 0.840645
H  -5.249733 -0.864394 -0.52829
H  -6.010842 0.925504 1.113218
H  -5.694034 -0.188659 2.479557
H  3.430364 1.287685 0.929268
H  4.494236 -2.216729 -1.425746
H  5.850421 1.949709 1.025004
H  6.939918 -1.528579 -1.315578
H  -8.554077 -0.111441 -2.775715
