program: Gaussian 09
title: 000210230
version: EM64L-G09RevD.01
frameworkgroup: C1[X(C14H15NS)]
method: RPBEPBE
basis: SDD
operation: Freq
keyword: #p
keyword: freq=noraman
keyword: PBEPBE/SDD
title: #p freq=noraman PBEPBE/SDD
converged: NO YES NO NO
title: Mulliken charges:
elementType: S N C C C C C C C C C C C C C C H H H H H H H H H H H H H H H
charge: 0.170606 -0.005612 -0.518076 -0.655657 0.495598 -0.801150 0.488687 -0.348284 -0.348309 -0.378252 -0.378040 -0.220368 -0.220387 -0.329152 -0.329141 -0.236986 0.231555 0.231572 0.261960 0.261833 0.261494 0.261582 0.236251 0.236260 0.235060 0.235055 0.226953 0.226948 0.239191 0.239193 0.229616
chargesum: 0.00000
title: Mulliken charges with hydrogens summed into heavy atoms:
elementType: S N C C C C C C C C C C C C C C
charge: 0.170606 -0.005612 -0.054949 -0.131863 0.495598 -0.278074 0.488687 -0.112033 -0.112049 -0.143192 -0.142986 0.006585 0.006561 -0.089961 -0.089949 -0.007369
polarizability: 2.65090890e+02 1.90645240e-02 1.61161747e+02 2.04587902e+01 6.36350006e-02 9.97370150e+01
1716.lowfreq: -25.9195 -12.4092 -3.9665 0.0003 0.0006 0.0023 6.6155 14.3665 25.1440
frequency: -12.1286 -6.4801 23.3098 34.2958 36.4089 75.8797 85.6911 148.3671 187.6002 273.0152 287.7756 324.2511 331.7755 368.8660 402.3379 473.2438 512.0359 548.9629 563.0193 616.5598 655.8146 663.5832 699.4542 705.5702 754.3881 776.4135 777.0625 799.4212 810.5638 850.4120 851.0107 887.2918 891.0867 924.0160 960.5560 965.2689 968.7084 975.5273 976.9040 989.9293 995.4467 1025.3739 1027.9413 1062.2614 1069.8817 1074.8169 1120.9727 1128.7433 1172.8222 1187.3036 1213.4748 1216.2629 1222.4982 1226.0428 1259.4071 1259.9428 1310.6816 1316.0998 1324.8918 1336.5296 1385.2908 1404.4272 1440.1805 1450.6742 1461.0297 1466.5123 1480.9393 1482.9963 1557.3827 1587.7898 1594.0006 1613.4435 2997.4613 3005.5812 3013.1166 3052.6177 3080.9079 3085.8365 3121.2330 3123.2318 3123.8051 3124.3310 3136.2958 3144.5051 3147.7905 3151.2993 3164.7318
redmass: 4.0763 3.9856 3.3303 6.4339 3.8614 5.9851 3.0925 6.5992 5.6772 5.7947 5.2843 2.3081 2.4770 2.4812 2.7949 3.8099 3.8398 5.8761 5.2547 6.3379 4.6762 6.9268 2.1964 2.8382 3.4597 1.1397 2.2088 2.6332 2.6772 1.2503 2.3505 1.2566 1.4654 1.4627 6.6271 1.3950 1.4754 1.3932 1.4922 5.8864 1.3356 2.4422 3.7554 2.1897 1.4824 1.4957 1.1273 1.0942 1.0520 1.1137 1.2016 1.4616 2.5879 1.9654 1.3468 1.2796 5.6765 1.3968 1.2770 1.2743 8.6880 2.0204 2.1940 1.0888 1.1144 1.9836 1.0997 2.3435 6.7378 5.7307 6.0948 6.1506 1.0582 1.0563 1.0567 1.1035 1.1086 1.1090 1.0851 1.0881 1.0863 1.0888 1.0919 1.0962 1.0964 1.0995 1.1017
irintensity: 0.1162 0.1540 0.4098 0.2878 0.7906 1.6554 3.0037 0.0515 1.0604 1.2346 0.7842 0.5609 0.0570 0.0009 0.0017 7.3343 15.9566 2.7214 14.2656 0.1059 44.3293 0.4151 51.6766 12.5480 1.3449 3.0533 25.1838 12.5248 32.3748 0.0271 18.1374 0.0255 0.4852 2.5625 2.4090 0.1759 0.3507 0.0043 0.0026 0.2458 0.0782 3.7575 6.3553 4.8327 6.4436 1.6138 3.3419 0.9510 0.0456 1.0752 9.8019 0.7037 1.8710 5.4426 11.4353 0.1774 1.1380 22.5157 0.1634 0.9290 0.1517 17.4155 7.8232 9.4790 3.6368 8.8351 7.4410 16.0532 12.7067 71.9656 1.1391 2.7089 3.3409 52.4609 16.7276 0.7335 36.9229 0.0357 6.7985 1.5218 2.9706 14.3779 14.6664 55.2746 42.3526 0.9971 24.1377
temp: 298.150 k
press: 1.00000 atm
elementType: 16 7 6 6 6 6 6 6 6 6 6 6 6 6 6 6 1 1 1 1 1 1 1 1 1 1 1 1 1 1 1
symmnumber: 1
zpe: 658694.9 jmol-1
zpe.correction: 0.250884 hartree
zpe.thermalcorrener: 0.264306 hartree
zpe.thermalcorrenthalpy: 0.265250 hartree
zpe.thermalcorrgfe: 0.207659 hartree
zpe.sumelectzpe: -994.141504 hartree
zpe.sumelectthermal: -994.128082 hartree
zpe.sumelectthermalent: -994.127138 hartree
zpe.sumelectthermalfe: -994.184728 hartree
dipole: 2.4358 -0.0001 -0.3633
dipole: 2.4628
quadrupole: -119.3975 -90.2398 -108.1984
quadrupole: 0.0505 -5.4518 0.0376
quadrupole: -13.4523 15.7054 -2.2532 0.0505 -5.4518 0.0376
hfenergy: -994.3923878 hartree
pointgroup: C01 [X(C14H15N1S1)]
dipole: 0.9588282 0.0007111 0.1395369 debye
polarizability: 264.9443211|-0.0521757|161.1615635|-21.0422143|-0.120218|99.8837671 unknown
InChI: InChI=1S/C14H15NS/c1-2-4-14(5-3-1)12-16-11-8-13-6-9-15-10-7-13/h1-7,9-10H,8,11-12H2
charge 0 multiplicity 1
31 atoms
S  0.815275 0.003397 -0.830184
N  -5.975714 -0.006022 0.6996
C  -1.983878 -0.002287 -1.131709
C  -0.902235 0.003086 -0.024516
C  -3.378043 -0.00361 -0.525228
C  1.858426 0.003788 0.77757
C  3.330884 0.000622 0.441067
C  -4.045854 -1.213834 -0.207291
C  -4.05122 1.20537 -0.213933
C  4.036361 1.220413 0.274179
C  4.031259 -1.222283 0.275473
C  5.412674 1.218909 -0.043818
C  5.407551 -1.226895 -0.042529
C  -5.323501 -1.168456 0.394485
C  -5.328648 1.157604 0.388136
C  6.102848 -0.005524 -0.202632
H  -1.840458 -0.895373 -1.767807
H  -1.844327 0.887794 -1.772874
H  -0.993043 0.90416 0.607682
H  -0.989781 -0.894476 0.613145
H  1.568966 -0.89562 1.347245
H  1.572198 0.90559 1.345064
H  -3.582188 -2.181581 -0.431306
H  -3.591874 2.173933 -0.443262
H  3.502715 2.171287 0.392014
H  3.493618 -2.170786 0.394249
H  5.945458 2.168542 -0.166601
H  5.936341 -2.178883 -0.164345
H  -5.857569 -2.092362 0.645038
H  -5.866795 2.080484 0.633693
H  7.170752 -0.007884 -0.448207
