program: Gaussian 09
title: 000016679
version: EM64L-G09RevD.01
frameworkgroup: C1[X(C15H10O)]
method: RPBEPBE
basis: SDD
operation: Freq
keyword: #pfreq=noraman
keyword: PBEPBE/SDD
title: #p freq=noraman PBEPBE/SDD
converged: YES YES NO NO
title: Mulliken charges:
elementType: O C C C C C C C C C C C C C C C H H H H H H H H H H
charge: -0.243547 0.140085 0.140055 0.479749 0.479759 -0.092582 -0.408262 -0.408265 -0.346103 -0.346091 -0.415204 -0.415209 -0.246032 -0.246035 -0.244982 -0.244981 0.210186 0.210187 0.288573 0.288574 0.237710 0.237710 0.237455 0.237455 0.234898 0.234898
chargesum: 0.00000
title: Mulliken charges with hydrogens summed into heavy atoms:
elementType: O C C C C C C C C C C C C C C C
charge: -0.243547 0.140085 0.140055 0.479749 0.479759 -0.092582 -0.198076 -0.198078 -0.057531 -0.057517 -0.177494 -0.177499 -0.008576 -0.008580 -0.010084 -0.010084
polarizability: 2.93216714e+02 -6.66613771e-05 1.76240760e+02 -7.81480590e-05 2.86366511e+00 6.48056507e+01
1716.lowfreq: -7.0275 -0.0007 -0.0007 -0.0005 6.4733 7.6714 26.1512 84.7129 120.7482
frequency: 26.1511 84.7010 120.7467 202.5672 217.9467 248.3471 314.4619 314.8295 389.3882 407.0574 409.2649 478.5507 489.0844 499.5675 546.5234 578.4184 588.0220 622.2175 664.5319 672.2511 722.2969 740.7837 759.4511 783.3237 806.2383 811.0157 833.1681 860.3161 895.1114 907.9483 921.4802 975.2962 981.0503 1001.3164 1005.2116 1008.7547 1040.4351 1055.7495 1092.1437 1115.1335 1153.0933 1170.1010 1178.2387 1182.8646 1228.7583 1246.4666 1253.4459 1289.5469 1312.7774 1396.5653 1398.5909 1408.8708 1415.0621 1466.3936 1477.9076 1489.4004 1500.3694 1563.6431 1566.7928 1606.2529 1606.8966 1646.3668 3089.5126 3115.8025 3123.6203 3124.5452 3140.6091 3140.8411 3157.8871 3158.1908 3172.0172 3172.9926
redmass: 6.4426 3.9188 5.0357 4.8223 3.9005 4.7768 5.6187 6.9678 3.6150 3.6615 8.5733 3.5121 3.1282 7.2779 5.6565 6.1540 3.0156 6.8850 5.7474 3.8682 5.8333 1.3568 2.0661 1.6840 3.0470 4.6492 1.4270 3.9224 1.5533 1.6933 6.6554 1.3562 1.3962 1.3656 1.3643 1.3569 2.9432 2.0805 3.1652 1.9771 2.0287 1.7954 1.0788 1.2787 2.0874 1.4265 1.6508 2.8387 1.4639 8.4629 3.9992 2.0423 1.7813 1.7827 2.3103 2.8906 9.4628 7.1655 7.1669 5.9228 5.8503 7.1838 1.0838 1.0936 1.0870 1.0871 1.0898 1.0899 1.0946 1.0947 1.0983 1.0983
irintensity: 2.9744 0.1961 1.2272 0.0044 2.6987 1.4722 6.5245 2.5066 1.4755 1.8685 3.8317 0.5417 16.6251 0.4184 0.0004 0.8380 0.0503 7.7516 3.9720 24.2923 0.2948 61.7896 1.0874 1.2603 14.8141 3.4086 95.3753 8.1501 1.4678 10.3120 13.9979 0.9647 9.0015 0.9300 1.2388 1.0765 2.3246 7.4939 2.9693 2.0502 20.1417 0.6550 1.0310 0.3964 23.6716 0.8808 0.1635 89.3352 1.7666 49.0083 33.2001 1.6342 16.1764 0.3158 6.5769 7.4702 125.5423 25.3000 2.4031 0.7487 13.0250 1.5761 0.1697 20.4699 0.2957 18.0438 1.1351 31.6594 30.7861 2.3722 48.6605 2.1902
temp: 298.150 k
press: 1.00000 atm
elementType: 8 6 6 6 6 6 6 6 6 6 6 6 6 6 6 6 1 1 1 1 1 1 1 1 1 1
symmnumber: 1
zpe: 527225.8 jmol-1
zpe.correction: 0.200810 hartree
zpe.thermalcorrener: 0.212244 hartree
zpe.thermalcorrenthalpy: 0.213189 hartree
zpe.thermalcorrgfe: 0.162614 hartree
zpe.sumelectzpe: -651.749830 hartree
zpe.sumelectthermal: -651.738395 hartree
zpe.sumelectthermalent: -651.737451 hartree
zpe.sumelectthermalfe: -651.788025 hartree
dipole: 0.0001 3.2687 -1.0035
dipole: 3.4192
quadrupole: -69.6216 -87.3621 -98.6969
quadrupole: -0.0001 -0.0001 3.9642
quadrupole: 15.6052 -2.1352 -13.4700 -0.0001 -0.0001 3.9642
hfenergy: -651.9506398 hartree
pointgroup: C01 [X(C15H10O1)]
dipole: 0.0000417 -1.3063855 -0.3209568 debye
dipolederiv: -0.5734389 0.0000178 -0.0000001 0.0000302 -1.0179976 -0.1704388 0.0000008 -0.0891715 -0.3478283 -0.3651671 -0.2840407 -0.026649 -0.1956895 -0.1624142 -0.0346014 0.0213911 -0.0405968 -0.0206755 -0.3652119 0.2840239 0.0266263 0.1956794 -0.1623679 -0.0345846 -0.0214073 -0.0405823 -0.020677 0.2548386 -0.1673715 0.0083841 0.0747239 0.0593722 0.0447155 0.0211378 0.0238692 0.0627004 0.2548229 0.1673845 -0.0083738 -0.0747228 0.059376 0.0447092 -0.0211307 0.0238769 0.0626994 1.1505836 0.0000117 0.0000236 0.0000043 0.9488599 0.2401385 0.0000221 0.1531603 0.1763471 0.0145542 0.1843761 0.0010555 -0.1817828 0.0867591 -0.069958 0.0755204 -0.0458584 -0.1402633 0.0145812 -0.1843777 -0.0010412 0.1817932 0.0867635 -0.0699476 -0.0755054 -0.0458794 -0.1402669 -0.1958885 0.2114839 -0.0024867 -0.0846244 0.0129417 -0.0305442 -0.0508005 0.0042522 -0.1043089 -0.1958904 -0.2115055 0.002485 0.0845976 0.0129237 -0.0305359 0.050796 0.0042444 -0.1043029 -0.3078865 0.1267428 -0.004989 0.1685219 0.1043216 -0.0210775 -0.0439274 -0.0139167 -0.1743457 -0.30785 -0.126779 0.0049819 -0.1685631 0.104294 -0.0210902 0.0439229 -0.0139216 -0.1743437 0.032024 -0.2285998 0.0410723 -0.0030701 -0.0685975 -0.0366335 0.0320313 -0.0413643 -0.1496708 0.0320089 0.2286138 -0.041053 0.0030913 -0.0685681 -0.0366364 -0.0320151 -0.0413503 -0.1496774 0.2099278 0.041687 0.028803 -0.0048606 0.0891598 -0.0087076 0.0573002 -0.022168 -0.126284 0.2099351 -0.041675 -0.0287761 0.0048677 0.0891532 -0.0087087 -0.0572678 -0.0221758 -0.1262907 0.0092432 -0.1085641 0.0165016 -0.0335069 -0.0788538 0.0427177 0.0000533 0.0343041 0.1317212 0.0092318 0.1085692 -0.016513 0.0335118 -0.0788406 0.0427179 -0.0000644 0.0343121 0.1317202 0.1371382 -0.0565236 0.0063528 0.0190755 0.0153607 0.0260818 0.0072702 0.0007761 0.1509973 0.1371443 0.0565348 -0.0063591 -0.0190677 0.0153719 0.0260798 -0.0072757 0.0007776 0.1509969 0.0838165 0.0032318 -0.0130781 -0.0665744 -0.1052143 0.0223399 -0.0065113 0.0314282 0.1507704 0.0838079 -0.0032141 0.0130709 0.0665927 -0.1052096 0.0223461 0.0065013 0.0314298 0.1507718 -0.0400094 0.0879808 -0.0351938 0.1113811 0.0041806 0.0300423 -0.0416196 0.0359871 0.1506245 -0.0399948 -0.0879878 0.0351765 -0.1113893 0.0041595 0.0300364 0.041602 0.0359831 0.1506298 -0.1211505 -0.0614218 -0.0257578 -0.0770904 0.0775264 0.0007655 -0.0266647 0.0012884 0.154476 -0.1211702 0.0614025 0.0257372 0.0770715 0.0775398 0.0007736 0.0266405 0.0012955 0.1544801 unknown
polarizability: 293.2167138|0.0060889|175.5540366|0.0083987|-9.179003|65.4923746 unknown
InChI: InChI=1S/C15H10O/c16-15-13-7-3-1-5-11(13)9-10-12-6-2-4-8-14(12)15/h1-10H
charge 0 multiplicity 1
26 atoms
O  -0.00008 2.442806 0.340239
C  -1.339001 0.515252 -0.063706
C  1.338973 0.51537 -0.063631
C  -1.63806 -0.887688 0.029667
C  1.638159 -0.88754 0.029766
C  -0.000045 1.185485 0.103607
C  -0.686442 -1.967439 0.261022
C  0.686625 -1.967378 0.261063
C  -2.414479 1.424672 -0.294564
C  2.414373 1.424901 -0.294393
C  -3.00626 -1.297923 -0.089784
C  3.006408 -1.297636 -0.089584
C  -3.742596 0.994994 -0.436764
C  3.742544 0.995357 -0.436499
C  -4.044137 -0.386415 -0.32614
C  4.044212 -0.386022 -0.325862
H  -1.158341 -2.946148 0.425456
H  1.158602 -2.946044 0.425527
H  -2.162155 2.487831 -0.342667
H  2.161946 2.488037 -0.342501
H  -3.235461 -2.366318 0.00054
H  3.235711 -2.366008 0.000759
H  -4.53866 1.723229 -0.624021
H  4.538548 1.723675 -0.623691
H  -5.07653 -0.739522 -0.422349
H  5.076647 -0.739027 -0.421991
