program: Gaussian 09
title: 000210223
version: EM64L-G09RevD.01
frameworkgroup: C1[X(C19H21N2S)]
method: RPBEPBE
basis: SDD
operation: Freq
keyword: #p
keyword: freq=noraman
keyword: PBEPBE/SDD
title: #p freq=noraman PBEPBE/SDD
converged: YES YES NO NO
title: Mulliken charges:
elementType: S N N C C C C C C C C C C C C C C C C C C C H H H H H H H H H H H H H H H H H H H H H
charge: 0.337575 -0.178554 -0.138659 0.476184 -0.237800 -0.322780 0.474768 0.259410 -0.642639 -0.317127 -0.359338 0.419231 -0.746213 -0.367657 -0.341944 -0.365730 -0.382430 -0.218340 -0.211398 -0.220026 -0.639077 -0.638990 0.278120 0.285901 0.256276 0.245569 0.243099 0.267690 0.257855 0.259931 0.259113 0.261024 0.248187 0.254509 0.249717 0.251116 0.241064 0.251485 0.251348 0.251705 0.253279 0.240155 0.254390
chargesum: 1.00000
title: Mulliken charges with hydrogens summed into heavy atoms:
elementType: S N N C C C C C C C C C C C C C C C C C C C
charge: 0.337575 -0.178554 -0.138659 0.476184 -0.237800 -0.322780 0.474768 0.259410 0.177658 -0.071558 -0.116239 0.419231 0.039262 -0.108544 -0.080920 -0.117543 -0.127921 0.031377 0.039718 0.034364 0.104820 0.106149
polarizability: 5.04252636e+02 -1.64252628e+01 2.26515468e+02 -2.51324849e+00 1.49574620e+01 1.37896764e+02
1716.lowfreq: -11.7734 -3.6222 -0.0010 0.0007 0.0017 3.9247 26.3157 34.9010 39.4895
frequency: 26.2823 34.8245 39.4185 49.0540 73.6914 85.0708 98.8789 120.4541 133.8233 142.1419 163.9605 179.7734 182.8061 199.9071 220.9858 228.8416 250.7329 274.4591 294.4175 330.6835 347.7044 359.6220 376.5651 402.2050 418.4914 426.7761 446.9327 478.9633 500.6234 517.7123 541.1950 548.7776 576.3630 610.0450 623.6297 628.0164 671.6329 675.9987 708.4052 732.7343 734.2696 771.3563 783.4212 804.0722 830.2577 860.8864 926.9816 936.4898 938.8317 957.0341 966.1537 977.4326 986.6395 989.0384 995.6201 1011.8705 1014.4518 1034.4224 1043.3948 1052.5073 1071.0772 1085.6804 1094.6037 1115.4407 1117.2595 1140.7682 1152.2781 1168.0852 1181.9637 1193.0415 1216.4024 1234.3037 1241.2602 1282.7006 1315.4551 1324.1716 1329.1417 1368.9687 1373.3437 1384.7856 1409.2904 1424.4641 1432.4701 1433.3334 1453.1123 1459.3175 1461.0575 1466.1117 1468.8586 1469.5459 1474.2267 1481.7996 1484.9494 1488.9320 1494.3368 1508.0140 1524.4175 1550.7030 1580.9299 1601.3490 1617.9193 1633.7091 2972.6756 2977.7703 2989.9497 3015.7928 3050.7866 3053.7319 3069.3792 3107.6132 3115.3719 3122.3595 3130.3617 3132.3182 3133.4693 3136.7629 3138.6607 3150.4549 3159.7169 3161.8132 3177.2730 3181.8075 3185.5692
redmass: 4.1409 3.3177 4.6873 3.4817 3.2521 2.4890 4.3800 1.9799 1.6379 1.2184 2.5470 2.2176 1.5724 4.3312 1.4601 2.4646 3.3267 3.6469 3.0742 4.7786 4.4439 3.8583 4.6924 2.8280 3.3146 3.1632 4.6198 3.7308 4.4061 2.8724 5.2911 4.3997 5.2182 6.4965 6.6379 7.0399 5.4926 5.0275 1.8440 3.8005 3.8990 4.6194 2.0393 1.2632 1.8257 1.2423 4.8274 2.1975 1.8926 1.3486 1.3556 5.3181 1.8914 2.7253 3.2723 1.5889 2.0005 1.8135 1.4092 1.5745 1.8535 1.6306 1.2345 1.3491 1.3264 2.2309 2.0537 1.6530 1.0562 1.1154 1.3895 2.0522 2.5326 3.9068 1.5967 3.0530 1.4797 3.7244 6.5567 2.4026 1.2139 1.6867 2.1430 1.1499 1.2328 1.0479 1.1070 1.0845 1.6679 1.0442 1.4129 2.1082 1.0449 1.3787 1.4888 1.4122 4.9382 3.5073 5.7732 6.3642 7.3063 6.1373 1.0367 1.0387 1.0377 1.0344 1.1005 1.1031 1.0983 1.0984 1.1016 1.0981 1.0892 1.0958 1.0905 1.0885 1.1028 1.0911 1.0877 1.0960 1.1016 1.0936 1.0956
irintensity: 0.2598 0.1351 0.4392 0.8872 0.4911 0.5916 0.8172 0.1332 2.2513 3.2247 4.6981 0.6834 0.6021 0.1855 0.7581 1.2655 1.5057 2.7017 3.3213 0.1159 0.7565 2.1472 7.6972 0.1233 0.8274 7.2808 2.0798 3.5563 19.4671 17.2937 2.1460 17.3915 1.4445 0.4418 1.8556 0.6288 3.1798 5.4094 50.9136 2.2603 7.1411 41.7645 43.7731 7.7672 76.9524 0.5348 42.4327 0.4114 1.2003 0.7597 0.3780 14.0792 3.8394 0.6603 24.5864 0.5833 1.4760 0.0976 0.9247 21.9659 7.8415 7.7221 0.4894 0.7630 0.4413 16.7808 6.1646 4.1967 0.0251 6.7539 184.5524 7.7363 17.1873 24.8195 4.6715 8.8821 13.3351 10.5516 0.8584 92.1906 15.4734 500.9407 16.1185 10.4041 51.7710 13.4424 3.2045 19.1031 24.9054 0.1972 11.2808 13.9763 33.8262 17.2572 35.1040 428.2980 22.5480 1.7826 3.8998 72.0873 175.9659 585.3861 47.1526 92.8045 7.9196 7.7572 3.0660 40.9201 4.3398 3.0342 5.4417 2.3443 5.3957 25.9174 0.9122 3.3454 0.3634 2.5406 2.9982 13.3219 13.0554 6.0877 5.2670
temp: 298.150 k
press: 1.00000 atm
elementType: 16 7 7 6 6 6 6 6 6 6 6 6 6 6 6 6 6 6 6 6 6 6 1 1 1 1 1 1 1 1 1 1 1 1 1 1 1 1 1 1 1 1 1
symmnumber: 1
zpe: 925975.1 jmol-1
zpe.correction: 0.352685 hartree
zpe.thermalcorrener: 0.374241 hartree
zpe.thermalcorrenthalpy: 0.375185 hartree
zpe.thermalcorrgfe: 0.301140 hartree
zpe.sumelectzpe: -1242.395747 hartree
zpe.sumelectthermal: -1242.374192 hartree
zpe.sumelectthermalent: -1242.373248 hartree
zpe.sumelectthermalfe: -1242.447292 hartree
dipole: 3.1493 -1.2860 0.4571
dipole: 3.4323
quadrupole: -23.0997 -109.9478 -133.4992
quadrupole: -4.4545 -0.5919 5.0097
quadrupole: 65.7492 -21.0989 -44.6503 -4.4545 -0.5919 5.0097
hfenergy: -1242.7484327 hartree
pointgroup: C01 [X(C19H21N2S1)]
dipole: 1.2352408 0.5148192 0.1806858 debye
polarizability: 504.2055255|15.5320508|173.5769074|7.7673105|45.8462019|190.8824355 unknown
InChI: InChI=1S/C19H21N2S/c1-14-18(15-8-6-5-7-9-15)21(4)19(22-14)16-10-12-17(13-11-16)20(2)3/h5-13H,1-4H3
charge 1 multiplicity 1
43 atoms
S  -0.304324 -2.058932 -1.324315
N  -0.888612 0.124729 -0.024235
N  5.792641 0.505415 0.149263
C  -2.158651 -0.475873 -0.31422
C  0.213914 -0.570499 -0.456515
C  -2.049618 -1.649358 -1.031199
C  1.609996 -0.247487 -0.292269
C  -3.426044 0.158482 0.13198
C  -0.812958 1.498096 0.536567
C  2.126994 0.465062 0.841191
C  2.564186 -0.713987 -1.257428
C  4.444111 0.257792 0.009541
C  -3.121309 -2.575783 -1.519996
C  3.491897 0.707516 0.992094
C  3.928378 -0.468757 -1.123004
C  -3.716337 0.305097 1.516176
C  -4.376769 0.594797 -0.8290
C  -4.935958 0.882771 1.928127
C  -5.596765 1.171346 -0.412095
C  -5.87786 1.31801 0.965693
C  6.299101 1.262392 1.312722
C  6.75366 0.008859 -0.85788
H  0.080207 2.002902 0.139362
H  -1.714142 2.049142 0.231042
H  -0.769718 1.479907 1.637834
H  1.458594 0.781405 1.646994
H  2.214943 -1.252089 -2.146767
H  -4.102012 -2.252321 -1.135585
H  -3.17596 -2.590191 -2.624246
H  -2.946725 -3.612966 -1.181816
H  3.833652 1.229348 1.888783
H  4.605085 -0.829011 -1.900897
H  -3.003945 -0.055867 2.267464
H  -4.155497 0.492504 -1.897506
H  -5.156451 0.983377 2.995689
H  -6.322879 1.506654 -1.159511
H  7.387969 1.383387 1.222154
H  6.092114 0.732533 2.262029
H  5.847687 2.270949 1.363685
H  6.555135 0.445472 -1.854995
H  6.718125 -1.093666 -0.940205
H  7.772757 0.293686 -0.559931
H  -6.824412 1.76376 1.288126
