program: Gaussian 09
title: 000210178
version: EM64L-G09RevD.01
frameworkgroup: C1[X(C11H17N2O2)]
method: RPBEPBE
basis: SDD
operation: Freq
keyword: #p
keyword: freq=noraman
keyword: PBEPBE/SDD
title: #p freq=noraman PBEPBE/SDD
converged: YES YES NO NO
title: Mulliken charges:
elementType: O O N N C C C C C C C C C C C H H H H H H H H H H H H H H H H H
charge: -0.269896 -0.266881 -0.109216 0.023628 -0.306639 -0.580845 -0.537911 -0.551514 -0.326889 0.210008 0.262501 -0.273061 -0.281006 -0.309858 -0.309764 0.283946 0.261325 0.261350 0.261434 0.319388 0.270194 0.267639 0.268104 0.263403 0.300695 0.259972 0.274715 0.263236 0.271629 0.268027 0.267636 0.264653
chargesum: 1.00000
title: Mulliken charges with hydrogens summed into heavy atoms:
elementType: O O N N C C C C C C C C C C C
charge: -0.269896 -0.266881 -0.109216 0.023628 0.238632 0.261326 0.268026 0.272556 0.211061 0.210008 0.262501 -0.001433 -0.012979 -0.042222 -0.045111
polarizability: 1.83282950e+02 2.97527793e+00 1.31630734e+02 -1.59396213e+01 5.20704873e+00 9.17042016e+01
1716.lowfreq: -16.7045 -4.5933 -0.0007 -0.0002 0.0005 3.9400 29.8776 42.9152 60.6589
frequency: 29.7486 42.9074 60.6330 96.2931 105.2420 136.6286 172.6882 202.7299 234.8423 254.6498 274.5751 287.3164 345.9133 350.5413 357.0320 363.2970 404.3348 431.4612 436.8011 454.3854 471.4346 527.1670 648.0965 656.7912 675.1124 693.2757 743.2554 758.3626 830.8041 844.3633 851.6903 893.0802 915.9692 924.1679 956.5762 985.0779 986.8423 990.1117 1011.9230 1033.3130 1053.3940 1059.9640 1077.9753 1088.5072 1113.0004 1129.3055 1199.4166 1211.1071 1223.1135 1243.3512 1252.9748 1278.4519 1300.1504 1325.3599 1328.5735 1375.2769 1383.7403 1401.0546 1423.7000 1427.0433 1437.0744 1447.4299 1450.8876 1457.7742 1463.7481 1470.1618 1473.7452 1485.7627 1493.5403 1511.5256 1548.1191 1572.4863 1615.6257 3014.6097 3022.9088 3025.6464 3035.1980 3037.3989 3095.1877 3104.2454 3135.4783 3137.5847 3142.4464 3144.2909 3148.1376 3152.5849 3154.7667 3174.1746 3176.6661 3188.5469
redmass: 4.4697 3.9394 3.0759 8.2004 2.5035 4.9708 3.4936 1.4456 2.6351 2.1798 1.1783 1.4073 2.5959 2.3219 2.4697 3.5531 2.8701 2.5050 2.3826 4.1760 5.4310 2.4311 6.1026 6.9673 3.6337 4.5363 2.9932 5.2265 3.4257 1.8205 2.3225 1.2470 3.4305 2.8209 6.6479 2.0028 1.4727 1.4594 2.2537 4.0957 1.2034 2.0546 1.9455 1.6502 1.3657 1.7634 1.3963 1.4470 1.7353 3.0152 1.8305 1.3089 10.2782 1.4242 1.2034 1.2594 1.2947 1.8325 1.1453 1.1444 1.0865 1.0896 1.0510 1.8361 1.1034 1.0833 1.0623 1.0549 1.0539 1.0540 7.8386 5.4914 9.6709 1.0324 1.0493 1.0418 1.0349 1.0589 1.1064 1.1054 1.1064 1.1054 1.1059 1.1054 1.1051 1.0886 1.0918 1.1041 1.0974 1.0966
irintensity: 1.1190 0.7331 1.2170 1.8555 1.4905 6.6841 7.4504 4.8330 4.4042 1.5528 1.5148 3.2481 7.2634 6.8891 0.0816 4.4168 0.9638 1.0110 2.5037 5.0176 5.9223 5.8334 15.2443 4.3480 3.8759 35.0538 13.2982 25.4047 9.0409 12.6223 40.6037 0.1244 33.0108 32.1554 1.6955 10.9337 1.8021 0.1885 11.6431 233.5239 1.6060 2.0400 35.4759 21.4406 6.2049 11.2723 0.7554 69.5574 5.9232 230.4936 6.0672 2.8110 2.5094 10.2831 9.5157 3.9307 8.7873 33.9276 10.2371 12.5113 6.9832 36.9074 1.1610 6.4852 17.5131 21.2537 25.8366 33.1040 22.6136 59.8419 40.4726 2.8240 241.4490 17.2967 0.5722 5.2527 10.0969 19.9772 1.0736 2.7194 8.5734 2.1605 0.5115 3.7338 6.4541 13.1453 0.6466 5.3973 4.4371 1.9327
temp: 298.150 k
press: 1.00000 atm
elementType: 8 8 7 7 6 6 6 6 6 6 6 6 6 6 6 1 1 1 1 1 1 1 1 1 1 1 1 1 1 1 1 1
symmnumber: 1
zpe: 709700.4 jmol-1
zpe.correction: 0.270311 hartree
zpe.thermalcorrener: 0.285512 hartree
zpe.thermalcorrenthalpy: 0.286456 hartree
zpe.thermalcorrgfe: 0.227412 hartree
zpe.sumelectzpe: -687.907640 hartree
zpe.sumelectthermal: -687.892439 hartree
zpe.sumelectthermalent: -687.891495 hartree
zpe.sumelectthermalfe: -687.950539 hartree
dipole: 13.5627 1.0328 1.2259
dipole: 13.6571
quadrupole: -38.6562 -75.2778 -81.4410
quadrupole: 1.6919 6.3361 -2.6801
quadrupole: 26.4688 -10.1528 -16.3160 1.6919 6.3361 -2.6801
hfenergy: -688.177951 hartree
pointgroup: C01 [X(C11H17N2O2)]
dipole: -5.2320196 0.9294992 -0.795272 debye
polarizability: 181.8677015|-13.3853532|128.8425766|-12.705247|-13.2910362|95.9076078 unknown
InChI: InChI=1S/C11H17N2O2/c1-13(2,3)8-9-15-11(14)10-4-6-12-7-5-10/h4-7H,8-9H2,1-3H3
charge 1 multiplicity 1
32 atoms
O  -0.364049 1.188633 0.35824
O  -0.558387 -0.875983 1.4205
N  -3.480904 0.165416 -0.369502
N  4.288784 -0.700051 -0.297659
C  -2.825306 1.54146 -0.069486
C  -3.817714 -0.583005 0.923343
C  -4.773558 0.445502 -1.142165
C  -2.575483 -0.711516 -1.238808
C  -1.665895 1.595208 0.931179
C  0.158886 -0.053304 0.793873
C  1.574593 -0.243904 0.402404
C  2.204389 -1.475853 0.721556
C  2.322414 0.759077 -0.26787
C  3.555324 -1.653967 0.352461
C  3.668598 0.481785 -0.594324
H  -2.508353 1.954063 -1.04279
H  -3.638533 2.174848 0.328924
H  -4.412592 0.075152 1.575781
H  -4.40652 -1.476076 0.662849
H  -2.881244 -0.884222 1.416848
H  -4.535615 1.024754 -2.04776
H  -5.236043 -0.512145 -1.424568
H  -5.463645 1.015753 -0.501816
H  -2.270045 -0.143477 -2.130291
H  -1.700068 -1.018122 -0.653648
H  -3.143789 -1.605137 -1.539638
H  -1.529774 2.65874 1.192018
H  -1.864826 1.024811 1.853703
H  1.653138 -2.260697 1.247708
H  1.873543 1.723025 -0.518651
H  4.082029 -2.586146 0.580239
H  4.285243 1.225378 -1.109549
