program: Gaussian 09
title: 000210184
version: EM64L-G09RevD.01
frameworkgroup: C1[X(C12H17N2O4)]
method: RPBEPBE
basis: SDD
operation: Freq
keyword: #p
keyword: freq=noraman
keyword: PBEPBE/SDD
title: #p freq=noraman PBEPBE/SDD
converged: YES YES NO NO
title: Mulliken charges:
elementType: O O O O N N C C C C C C C C C C C C H H H H H H H H H H H H H H H H H
charge: -0.274029 -0.266360 -0.174548 -0.176474 -0.109264 0.033746 -0.306557 -0.552160 -0.537611 -0.580519 -0.327010 0.196819 0.249085 -0.317773 -0.310887 -0.339417 -0.332739 0.394554 0.261624 0.284091 0.263179 0.260547 0.300801 0.268359 0.267825 0.270267 0.262107 0.318108 0.262019 0.263888 0.274834 0.283349 0.279629 0.306527 0.303989
chargesum: 1.00000
title: Mulliken charges with hydrogens summed into heavy atoms:
elementType: O O O O N N C C C C C C C C C C C C
charge: -0.274029 -0.266360 -0.174548 -0.176474 -0.109264 0.033746 0.239158 0.272368 0.268841 0.261716 0.211711 0.196819 0.249085 -0.034424 -0.031258 -0.032890 -0.028749 0.394554
polarizability: 2.43031554e+02 -8.40457167e-01 1.52398829e+02 -1.76622459e+01 -2.44668230e+00 9.62971009e+01
1716.lowfreq: -2.2993 -0.0001 0.0005 0.0007 3.2646 14.5359 25.9863 35.1572 59.6969
frequency: 25.9041 34.7079 59.5822 61.8275 81.9563 94.2850 112.2978 138.2160 199.5822 211.1223 226.9437 252.9661 266.0501 274.1797 303.3741 316.9237 349.7400 361.5773 395.7455 408.2733 426.6863 436.7370 454.0238 460.5190 488.6295 514.1325 529.0656 621.8021 650.3350 667.2167 680.6772 688.7484 748.2155 765.0379 788.9750 830.6680 848.3010 864.0549 889.1975 915.4079 924.4951 984.0079 1002.1514 1007.0137 1012.2277 1013.2164 1034.8784 1050.9729 1079.1927 1087.7316 1111.0746 1113.7018 1128.4260 1180.6291 1199.1819 1207.0483 1223.3836 1238.5452 1253.1154 1277.3452 1296.6820 1329.6170 1374.5526 1377.9107 1381.6632 1406.1545 1415.6303 1420.9938 1426.7005 1435.2996 1447.1065 1453.5650 1464.1779 1468.0726 1474.2200 1475.1040 1487.9567 1493.4284 1516.4365 1587.0216 1608.1907 1616.3754 3016.2984 3023.1355 3025.5435 3034.4780 3037.8708 3095.4134 3104.5775 3137.4671 3138.7191 3142.1524 3144.2644 3148.0793 3167.2225 3174.1250 3178.0683 3189.6390 3194.8578
redmass: 5.5379 5.9156 3.1462 6.0115 5.0171 6.5341 4.3146 3.7264 3.3177 1.5575 3.0823 4.3945 2.9362 1.2058 1.9911 2.6352 2.1490 2.0601 2.7603 2.8625 2.2083 2.4068 4.8727 4.1411 8.4917 4.6843 2.7156 7.1015 5.8874 4.0178 5.2679 4.2422 6.4474 5.3265 7.2767 3.5799 2.8482 1.2465 1.6599 3.4238 2.7941 2.2889 3.0761 1.3906 1.4359 1.9749 3.5489 1.2021 2.0227 3.3167 1.3631 1.3136 1.7292 1.2840 1.3991 6.0853 1.7551 4.2203 1.7992 1.3322 1.2612 1.2035 1.3125 5.3496 1.3189 7.2624 5.0468 1.1495 1.1521 1.0854 1.0863 1.0458 1.0989 1.1045 1.8982 1.1586 1.0585 1.0553 1.0531 8.4692 6.4356 8.8915 1.0324 1.0484 1.0428 1.0341 1.0594 1.1061 1.1055 1.1067 1.1050 1.1060 1.1055 1.1051 1.0906 1.1044 1.0894 1.0962 1.0976
irintensity: 1.5244 0.3541 0.9131 0.1828 1.3962 1.8946 2.6529 16.8255 5.7050 1.7833 3.5786 0.7312 1.0291 0.5102 4.7166 1.7449 5.3417 10.0007 1.2585 0.0261 0.1698 1.0547 2.2639 0.9768 11.4489 6.1474 3.4513 1.1733 2.2777 2.4049 7.6203 51.7814 6.5217 5.3923 71.2953 7.5356 15.6940 1.1121 58.6863 29.3140 29.8042 31.1832 63.6067 4.6219 0.5577 2.1510 245.3972 1.5458 57.5031 9.3594 8.1069 11.9972 13.3417 2.0651 0.6317 345.1936 7.8568 200.2819 1.6082 3.0658 0.4621 7.8014 7.6947 62.5757 10.3738 17.5822 80.3754 13.3837 9.8871 6.4402 38.5742 0.4210 28.2798 31.0290 2.3558 22.6802 27.5617 32.5662 48.6694 91.2968 6.9160 254.7625 16.4392 0.5214 5.5575 10.8018 21.5914 1.3854 2.5844 7.9250 2.5141 0.6531 3.5100 6.1131 1.4886 6.8054 2.3051 3.4673 2.2189
temp: 298.150 k
press: 1.00000 atm
elementType: 8 8 8 8 7 7 6 6 6 6 6 6 6 6 6 6 6 6 1 1 1 1 1 1 1 1 1 1 1 1 1 1 1 1 1
symmnumber: 1
zpe: 744560.5 jmol-1
zpe.correction: 0.283588 hartree
zpe.thermalcorrener: 0.301459 hartree
zpe.thermalcorrenthalpy: 0.302404 hartree
zpe.thermalcorrgfe: 0.236708 hartree
zpe.sumelectzpe: -876.172964 hartree
zpe.sumelectthermal: -876.155092 hartree
zpe.sumelectthermalent: -876.154148 hartree
zpe.sumelectthermalfe: -876.219844 hartree
dipole: 20.2855 -1.1783 1.3813
dipole: 20.3666
quadrupole: -39.3128 -94.8458 -95.5368
quadrupole: -4.8462 13.0542 3.2905
quadrupole: 37.2524 -18.2807 -18.9717 -4.8462 13.0542 3.2905
hfenergy: -876.4565517 hartree
pointgroup: C01 [X(C12H17N2O4)]
dipole: 7.9132773 1.2144152 0.3327861 debye
polarizability: 239.551534|0.3508662|147.069921|27.5682642|17.5801743|105.1060289 unknown
InChI: InChI=1S/C12H17N2O4/c1-14(2,3)8-9-18-12(15)10-4-6-11(7-5-10)13(16)17/h4-7H,8-9H2,1-3H3
charge 1 multiplicity 1
35 atoms
O  1.464758 0.736269 1.078284
O  1.627775 -1.520428 0.521447
O  -5.188244 -1.242503 -1.327594
O  -5.257161 0.946456 -0.67693
N  4.542006 0.423606 -0.245072
N  -4.650539 -0.175808 -0.848832
C  3.922484 1.27196 0.898356
C  3.596554 0.320171 -1.445037
C  5.818961 1.141303 -0.692679
C  4.897868 -0.985475 0.237505
C  2.790325 0.661325 1.731015
C  0.917439 -0.484887 0.613961
C  -0.512124 -0.367328 0.248457
C  -1.156921 -1.519464 -0.280586
C  -1.232302 0.84604 0.421666
C  -2.514896 -1.46291 -0.640646
C  -2.590941 0.911625 0.062953
C  -3.205216 -0.244637 -0.46374
H  4.758557 1.495572 1.585579
H  3.588522 2.218284 0.438959
H  3.28422 1.330907 -1.747293
H  4.136562 -0.168461 -2.270646
H  2.727965 -0.288784 -1.166793
H  6.535757 1.161867 0.142332
H  6.255927 0.596662 -1.543103
H  5.568043 2.16865 -0.998875
H  5.513977 -0.909777 1.147084
H  3.969193 -1.541935 0.435805
H  5.471027 -1.488553 -0.556504
H  2.994709 -0.375527 2.046042
H  2.688931 1.293818 2.629524
H  -0.586784 -2.446297 -0.395711
H  -0.729682 1.721658 0.839354
H  -3.043597 -2.328601 -1.047493
H  -3.178252 1.825504 0.182811
