program: Gaussian 09
title: 000210182
version: EM64L-G09RevD.01
frameworkgroup: C1[X(C12H17N2O4)]
method: RPBEPBE
basis: SDD
operation: Freq
keyword: #p
keyword: freq=noraman
keyword: PBEPBE/SDD
title: #p freq=noraman PBEPBE/SDD
converged: YES YES NO NO
title: Mulliken charges:
elementType: O O O O N N C C C C C C C C C C C C H H H H H H H H H H H H H H H H H
charge: -0.268199 -0.254953 -0.175387 -0.183802 -0.119163 0.028549 -0.351994 -0.542977 -0.547815 -0.552336 -0.300600 0.191603 0.257156 -0.449755 -0.329109 0.388345 -0.173544 -0.333017 0.280643 0.306063 0.270969 0.258476 0.295659 0.268803 0.272175 0.275617 0.270897 0.273032 0.272559 0.225528 0.279488 0.321214 0.278930 0.260723 0.306223
chargesum: 1.00000
title: Mulliken charges with hydrogens summed into heavy atoms:
elementType: O O O O N N C C C C C C C C C C C C
charge: -0.268199 -0.254953 -0.175387 -0.183802 -0.119163 0.028549 0.234712 0.282127 0.268781 0.264152 0.204416 0.191603 0.257156 -0.128541 -0.050179 0.388345 0.087179 -0.026795
polarizability: 2.32714289e+02 -4.34830908e-01 1.60541397e+02 1.15479827e+01 8.03015996e+00 9.13326363e+01
1716.lowfreq: -17.7125 -6.2609 -4.2351 -0.0010 -0.0008 -0.0007 16.2431 32.3824 37.7569
frequency: 14.5154 32.1296 37.7337 46.0404 57.1014 96.9505 122.5430 152.5656 160.9840 179.9373 187.9825 214.8853 242.5529 260.3811 269.3086 312.0278 347.1048 359.9123 376.7512 394.8336 421.0034 425.9680 449.0595 468.8613 472.5417 498.2821 531.1794 642.4338 656.1060 676.8236 693.5370 711.5781 739.8676 747.5192 796.4648 832.2992 834.4431 887.1598 918.7096 938.2624 968.8718 970.9216 973.5680 988.3195 1018.2057 1034.0321 1047.3753 1051.6394 1059.9209 1082.0688 1088.4228 1109.6135 1129.2134 1180.5443 1195.4787 1208.1585 1217.6863 1239.7814 1252.4546 1274.0474 1287.4309 1313.9133 1346.5245 1385.5427 1390.4849 1401.8885 1423.8383 1427.6074 1437.3861 1440.4907 1446.9755 1455.2680 1458.3534 1463.9453 1470.5918 1470.7655 1480.9284 1486.0363 1494.0559 1580.9060 1614.1944 1623.9828 3023.9981 3024.8106 3028.1439 3036.7100 3041.3094 3108.2878 3127.6494 3140.6638 3145.2469 3146.1908 3151.7615 3151.9163 3164.2691 3167.4830 3179.6340 3181.0226 3190.8614
redmass: 3.0709 6.8732 4.2295 2.8430 9.2360 3.2615 2.4503 3.3481 2.2834 4.0972 4.4077 1.4722 2.0555 1.1141 3.4010 3.8072 2.5619 3.4481 3.7351 5.0037 3.1504 2.2618 3.2435 6.3550 4.8697 3.5008 5.3110 6.8210 5.6295 5.6553 2.4964 3.5636 6.5250 5.6061 2.9814 2.4559 1.7022 3.1995 2.7605 3.5019 1.4057 1.5167 3.0472 6.2658 1.3740 3.2027 1.2088 3.2882 1.6467 1.9251 1.6382 1.4316 1.5087 1.1691 1.4817 6.1814 1.8189 3.8705 1.8566 1.2168 1.3744 1.2656 1.2557 8.5562 1.2964 7.2217 1.1521 1.1337 3.0167 1.0811 1.0744 1.0775 1.0595 1.1657 1.6993 1.3080 1.0584 1.0551 1.0559 6.9062 7.1259 9.7276 1.0563 1.0360 1.0353 1.0340 1.0584 1.1055 1.1047 1.1056 1.1054 1.1053 1.1051 1.1060 1.0887 1.1047 1.0926 1.0930 1.0995
irintensity: 1.1220 4.4623 3.1879 0.4265 1.5172 1.5825 4.4428 0.6518 1.5915 1.8336 4.4135 1.1239 3.0349 0.7176 2.4306 12.1785 5.3557 0.9151 7.6963 0.7354 0.2038 0.4668 1.0089 6.7778 0.8631 2.3356 0.6630 4.8341 2.4288 13.3153 56.8842 30.7837 15.4655 36.2446 3.8810 6.9309 20.3067 41.3824 22.9652 37.7307 4.1558 10.0240 9.8723 8.0555 0.7705 44.4688 0.5929 154.4160 95.3798 78.6414 21.1058 0.7421 17.7628 50.1445 39.5135 281.2983 0.1326 112.8615 1.7537 1.7429 8.2508 1.9071 7.0394 83.5031 14.2206 5.7143 11.6241 19.2158 27.5646 2.8876 1.3132 27.9630 19.3854 38.2154 4.6289 15.7350 59.5731 60.2977 82.0613 45.0361 22.6988 239.3374 16.2137 5.3042 7.1416 8.0958 5.0102 1.1187 4.3105 0.5313 0.5680 4.7379 7.1330 5.7556 3.4777 0.8603 6.8355 5.2056 3.3634
temp: 298.150 k
press: 1.00000 atm
elementType: 8 8 8 8 7 7 6 6 6 6 6 6 6 6 6 6 6 6 1 1 1 1 1 1 1 1 1 1 1 1 1 1 1 1 1
symmnumber: 1
zpe: 742939.2 jmol-1
zpe.correction: 0.282971 hartree
zpe.thermalcorrener: 0.301320 hartree
zpe.thermalcorrenthalpy: 0.302264 hartree
zpe.thermalcorrgfe: 0.234081 hartree
zpe.sumelectzpe: -876.171701 hartree
zpe.sumelectthermal: -876.153351 hartree
zpe.sumelectthermalent: -876.152407 hartree
zpe.sumelectthermalfe: -876.220590 hartree
dipole: -19.8728 3.3151 1.5218
dipole: 20.2048
quadrupole: -17.5452 -96.1120 -97.7535
quadrupole: 24.8680 -2.9867 -1.2892
quadrupole: 52.9250 -25.6417 -27.2833 24.8680 -2.9867 -1.2892
hfenergy: -876.4546711 hartree
pointgroup: C01 [X(C12H17N2O4)]
dipole: 7.764287 -1.2599606 -1.1480311 debye
polarizability: 229.1206094|11.6089227|141.9643426|-22.2225692|30.6335204|113.5033702 unknown
InChI: InChI=1S/C12H17N2O4/c1-14(2,3)7-8-18-12(15)10-5-4-6-11(9-10)13(16)17/h4-6,9H,7-8H2,1-3H3
charge 1 multiplicity 1
35 atoms
O  1.327061 -0.978765 -1.083154
O  1.025158 1.017406 0.074079
O  -5.241933 0.434933 1.550452
O  -3.527884 1.887778 1.959515
N  4.691384 0.248933 0.200808
N  -4.017455 0.814848 1.441138
C  3.550781 -0.771979 -0.026806
C  4.122724 1.620046 0.59185
C  5.562349 -0.264629 1.35052
C  5.556586 0.378912 -1.052339
C  2.714972 -0.531927 -1.310264
C  0.525632 -0.047411 -0.369106
C  -0.878753 -0.489915 -0.229682
C  -1.753873 0.343211 0.511752
C  -1.356718 -1.695903 -0.812395
C  -3.091925 -0.056562 0.655342
C  -2.707998 -2.066591 -0.652285
C  -3.591171 -1.248327 0.086196
H  4.023069 -1.768543 -0.042983
H  2.899284 -0.702198 0.858692
H  3.656859 1.539069 1.585035
H  4.950583 2.344864 0.615521
H  3.3514 1.926719 -0.126771
H  6.06161 -1.195484 1.041092
H  6.314726 0.499815 1.597377
H  4.923988 -0.453818 2.226701
H  5.894741 -0.621668 -1.363607
H  4.973607 0.848737 -1.857239
H  6.427964 1.009392 -0.818806
H  2.703548 0.533123 -1.603095
H  3.06384 -1.148046 -2.151534
H  -1.40354 1.276929 0.96083
H  -0.672964 -2.326588 -1.386678
H  -3.077065 -2.992315 -1.102952
H  -4.643389 -1.51115 0.226699
