program: Gaussian 09
title: 000210197
version: EM64L-G09RevD.01
frameworkgroup: C1[X(C21H18Cl2N2O)]
method: RPBEPBE
basis: SDD
operation: Freq
keyword: #p
keyword: freq=noraman
keyword: PBEPBE/SDD
title: #p freq=noraman PBEPBE/SDD
converged: YES YES NO NO
title: Mulliken charges:
elementType: Cl Cl O N N C C C C C C C C C C C C C C C C C C C C C H H H H H H H H H H H H H H H H H H
charge: -0.019089 -0.013516 -0.231641 -0.524898 -0.503566 0.291509 0.099391 0.300416 0.370931 0.054935 -0.396768 -0.453846 -0.860322 -0.230705 -0.386411 -0.838541 -0.337773 0.099190 -0.217569 -0.268269 0.629083 -0.337883 -0.342301 -0.071057 -0.208193 -0.252439 0.338219 0.274352 0.231964 0.254866 0.233094 0.241569 0.226823 0.277270 0.232465 0.231224 0.231906 0.259736 0.229509 0.234503 0.331065 0.317663 0.240098 0.263007
chargesum: 0.00000
title: Mulliken charges with hydrogens summed into heavy atoms:
elementType: Cl Cl O N N C C C C C C C C C C C C C C C C C C C C C
charge: -0.019089 -0.013516 -0.231641 -0.186679 -0.172500 0.291509 0.099391 0.300416 0.370931 0.054935 -0.122416 -0.221882 -0.130794 -0.003882 -0.109141 -0.142946 -0.078036 0.099190 0.011940 -0.033767 0.629083 -0.337883 -0.024638 -0.071057 0.031905 0.010568
polarizability: 3.35985022e+02 -2.32598433e+01 3.26236133e+02 2.31787186e+01 7.55998485e+00 1.88029363e+02
1716.lowfreq: -8.2028 -4.6687 -0.0020 -0.0016 -0.0013 3.1102 15.7587 22.1688 30.7698
frequency: 15.5107 22.1248 30.7645 47.1267 51.5572 66.7980 71.3985 96.7386 127.6822 138.2601 146.9802 163.5634 172.1059 191.3534 198.9125 213.1110 230.5282 241.5440 261.0183 270.8437 289.4316 305.9307 325.5921 338.2679 356.6645 408.6626 423.0465 446.3473 466.1265 494.7528 496.1581 500.4313 505.5854 514.4168 528.9037 550.1056 560.0524 575.5350 597.4854 608.3685 679.5949 693.2312 705.5932 708.5910 711.8874 736.9205 746.6996 756.7720 766.6603 785.3111 788.9243 803.8840 826.7009 858.1908 869.7289 873.1022 901.5113 903.5483 914.5103 955.1641 971.6538 984.2533 988.0183 993.8873 1005.2048 1024.3219 1039.5994 1048.9487 1062.2228 1074.5261 1088.9828 1096.0158 1117.6287 1158.3066 1175.2986 1183.7677 1193.2504 1198.7580 1219.8466 1243.4498 1260.2625 1291.4633 1295.1383 1324.0253 1341.5482 1351.1210 1375.6594 1394.1859 1400.3453 1402.5436 1426.3036 1441.7957 1447.9130 1453.9268 1463.5221 1468.1767 1478.3406 1487.5300 1489.6931 1492.5265 1515.3844 1565.4723 1579.9491 1596.3130 1597.0354 1604.0042 1609.8231 1620.5559 2955.8882 2974.0712 3038.9851 3049.8719 3084.4003 3105.7808 3125.3975 3133.9235 3144.7892 3145.9236 3154.5595 3162.8991 3167.3722 3175.1366 3181.3700 3201.0040 3457.8535 3507.3793
redmass: 4.0110 6.7590 7.4104 5.3440 6.4295 6.1476 8.3021 4.2179 1.7633 4.6195 2.0573 4.3872 4.9301 1.1422 15.3939 5.2221 7.3595 3.1319 4.2520 5.0100 7.0198 3.7328 4.7144 3.2499 7.9149 4.5345 7.3297 3.1432 7.1947 2.5172 4.2850 3.1592 3.9396 3.2570 2.4719 4.5518 4.4183 3.5575 5.8869 5.2230 6.3214 5.6302 2.8176 7.2098 2.9315 1.4751 2.1758 2.8922 1.7596 1.6128 1.4848 4.1338 4.5598 3.2442 1.9984 3.9563 1.3412 1.3766 2.3765 1.3808 1.3300 1.3305 1.3106 1.4433 6.9348 1.4489 2.7835 1.6322 2.9398 2.2046 1.9510 1.8156 1.8266 1.6535 1.0769 1.2246 2.9542 1.4046 1.9684 2.5278 1.8877 2.0146 2.1604 2.3283 3.8461 4.9605 7.2089 1.3081 2.7557 1.3421 2.4077 2.4792 2.1715 2.2535 1.6059 1.1355 1.6326 2.1618 1.0756 1.2172 2.1603 6.0988 4.5163 6.5546 6.9477 5.4308 5.0032 5.3524 1.0472 1.0379 1.0885 1.0971 1.0983 1.0951 1.0865 1.0862 1.0919 1.0909 1.0887 1.0958 1.0965 1.0994 1.0955 1.0955 1.0763 1.0754
irintensity: 0.3203 0.0994 0.1614 3.6521 1.0202 1.3032 4.4331 3.8871 0.5122 4.0909 1.1926 0.4286 1.7264 2.4490 0.7967 0.9163 0.1324 1.1935 3.5229 0.4580 2.0412 18.2072 3.0918 1.2774 8.2202 1.9527 3.7842 4.6529 3.4056 62.6112 1.1897 1.8534 3.0725 37.9111 34.7688 4.8144 1.2846 35.5877 26.7823 0.7467 8.6836 5.7735 19.8523 10.3541 12.7930 22.8081 28.0258 26.5669 51.6801 25.2463 76.5238 3.3704 1.9917 23.2545 1.8805 4.3805 0.5047 3.6226 5.1894 1.3807 0.3267 3.5777 0.4627 10.4703 54.2763 9.8261 29.0719 3.4449 24.8552 17.9913 10.6059 39.4630 50.4643 8.7659 5.5451 0.1005 1.1209 13.5482 107.9300 109.7753 1.6980 46.9938 26.1767 129.0313 114.8558 101.7225 2.2859 7.1237 24.5065 32.3043 14.1381 80.2179 103.2412 1.7897 51.6792 59.7517 35.7412 382.7736 6.8980 124.2530 153.6288 59.0838 168.1256 132.9860 110.4848 124.1740 67.2747 55.2732 29.6996 33.4061 15.5970 18.4021 25.7578 14.6219 4.6674 5.8588 22.2845 17.2599 8.2809 12.9909 8.7894 20.6109 2.3374 8.8194 33.8828 52.2021
temp: 298.150 k
press: 1.00000 atm
elementType: 17 17 8 7 7 6 6 6 6 6 6 6 6 6 6 6 6 6 6 6 6 6 6 6 6 6 1 1 1 1 1 1 1 1 1 1 1 1 1 1 1 1 1 1
symmnumber: 1
zpe: 881919.4 jmol-1
zpe.correction: 0.335905 hartree
zpe.thermalcorrener: 0.359868 hartree
zpe.thermalcorrenthalpy: 0.360812 hartree
zpe.thermalcorrgfe: 0.280063 hartree
zpe.sumelectzpe: -1914.084857 hartree
zpe.sumelectthermal: -1914.060894 hartree
zpe.sumelectthermalent: -1914.059950 hartree
zpe.sumelectthermalfe: -1914.140699 hartree
dipole: -0.7919 -1.6485 -0.2473
dipole: 1.8455
quadrupole: -155.0531 -162.0545 -168.5116
quadrupole: 0.5472 10.6774 -7.7738
quadrupole: 6.8199 -0.1814 -6.6385 0.5472 10.6774 -7.7738
hfenergy: -1914.4207626 hartree
pointgroup: C01 [X(C21H18Cl2N2O1)]
dipole: 0.4618378 -0.5229205 0.2010955 debye
polarizability: 324.2538912|27.000463|331.874145|19.5831085|-29.5992057|194.1224816 unknown
InChI: InChI=1S/C21H18Cl2N2O/c1-13-7-5-11-17(14(13)2)24-18-10-4-3-8-15(18)21(26)25-19-12-6-9-16(22)20(19)23/h3-12,24-25H,1-2H3
charge 0 multiplicity 1
44 atoms
Cl -2.259502 -1.049253 2.293591
Cl -4.705582 -3.12693 1.743133
O  -1.666107 2.120754 -1.92831
N  1.417906 0.338794 -0.010994
N  -1.561433 0.65785 -0.083007
C  2.61429 -0.443398 -0.044237
C  2.547602 -1.794927 0.419675
C  1.304238 1.734473 0.128948
C  3.708434 -2.618147 0.326325
C  0.115854 2.426827 -0.297749
C  3.817559 0.073016 -0.592359
C  4.907857 -2.078814 -0.203133
C  1.241809 -2.320043 0.991643
C  4.961471 -0.743594 -0.658737
C  2.359421 2.50861 0.698252
C  3.689732 -4.065376 0.79452
C  0.066067 3.843261 -0.239383
C  -1.092235 1.740198 -0.866944
C  2.267383 3.908691 0.784413
C  1.127944 4.594648 0.295688
C  -2.654478 -0.202637 -0.353306
C  -3.093518 -1.095245 0.670098
C  -3.324771 -0.236296 -1.607706
C  -4.152547 -1.99338 0.441708
C  -4.382386 -1.141838 -1.818395
C  -4.807586 -2.028449 -0.805571
H  0.56082 -0.16441 -0.250574
H  3.843735 1.090654 -0.991923
H  5.799325 -2.713225 -0.265182
H  1.381544 -3.269154 1.531044
H  0.486392 -2.513569 0.201166
H  0.794486 -1.59479 1.695968
H  5.888268 -0.344664 -1.08565
H  3.246782 1.998405 1.081736
H  2.917294 -4.658825 0.27035
H  3.479812 -4.14558 1.878515
H  4.664702 -4.547074 0.60972
H  -0.832819 4.338502 -0.621812
H  3.09383 4.469218 1.235777
H  1.067562 5.685975 0.343671
H  -1.186787 0.601699 0.872036
H  -3.01246 0.464115 -2.382996
H  -4.888549 -1.155729 -2.788666
H  -5.629158 -2.730645 -0.968344
