program: Gaussian 09
title: 000210194
version: EM64L-G09RevD.01
frameworkgroup: C1[X(C21H19ClN2O)]
method: RPBEPBE
basis: SDD
operation: Freq
keyword: #p
keyword: freq=noraman
keyword: PBEPBE/SDD
title: #p freq=noraman PBEPBE/SDD
converged: YES YES NO NO
title: Mulliken charges:
elementType: Cl O N N C C C C C C C C C C C C C C C C C C C C C H H H H H H H H H H H H H H H H H H H
charge: -0.076919 -0.348846 -0.519394 -0.461561 0.302987 0.094405 0.303203 0.371357 0.069936 -0.410370 -0.456802 -0.852556 -0.230209 -0.380865 -0.840817 -0.323877 0.190596 -0.224082 -0.294701 0.595698 -0.367900 -0.320488 -0.220481 -0.220055 -0.243387 0.396025 0.268405 0.230050 0.247580 0.245008 0.245982 0.224422 0.275963 0.229939 0.230343 0.232179 0.213707 0.229695 0.232704 0.321238 0.318773 0.255086 0.232084 0.235945
chargesum: 0.00000
title: Mulliken charges with hydrogens summed into heavy atoms:
elementType: Cl O N N C C C C C C C C C C C C C C C C C C C C C
charge: -0.076919 -0.348846 -0.123369 -0.140323 0.302987 0.094405 0.303203 0.371357 0.069936 -0.141965 -0.226751 -0.113987 -0.005787 -0.104902 -0.148356 -0.110170 0.190596 0.005613 -0.061997 0.595698 -0.367900 -0.001715 0.034605 0.012029 -0.007441
polarizability: 4.27183974e+02 2.52106011e+00 3.16189804e+02 -1.34228083e+01 1.23612070e+01 1.36978609e+02
1716.lowfreq: -5.8123 -3.0639 0.0012 0.0013 0.0016 2.2526 15.7804 27.7458 30.4825
frequency: 15.7750 27.6029 30.4792 55.9248 63.6454 76.0558 100.8787 125.4918 136.3648 149.7891 157.2557 167.3090 183.8581 212.3784 215.1196 244.6268 251.3596 273.4561 289.1474 323.3554 341.2570 370.8589 383.7467 412.3417 427.7097 439.7118 453.3465 479.7338 505.0843 511.5261 521.5958 538.7761 549.1128 570.9764 575.9319 611.1038 655.7633 670.4947 679.6524 690.6254 711.4886 723.2957 737.4888 752.5361 760.2479 765.7466 780.6680 797.8655 819.7180 828.8865 841.5062 858.7257 866.6420 872.8590 899.5113 920.8013 942.5201 949.2407 967.1667 988.5411 994.0571 996.2197 1005.0790 1027.1651 1035.2135 1046.3874 1050.4804 1062.4873 1079.3294 1097.5994 1125.1122 1141.8214 1170.4904 1181.1169 1183.8581 1192.1533 1231.0078 1240.3164 1261.1535 1262.5361 1293.3914 1308.3847 1336.7756 1355.2000 1371.8476 1382.2745 1397.5678 1408.3689 1418.2427 1432.8951 1437.6620 1450.7345 1456.6092 1464.5108 1468.2494 1481.5325 1490.7685 1492.3413 1508.3444 1523.6376 1564.9503 1578.6768 1590.3415 1596.4212 1611.8725 1615.5447 1629.4366 2968.5854 2973.0325 3042.7553 3048.9642 3082.7740 3108.6068 3117.9582 3123.4299 3135.3884 3142.1505 3142.6927 3159.0002 3161.6359 3165.0925 3176.5797 3176.6892 3197.7743 3243.5665 3495.5706
redmass: 8.3934 3.9990 5.7100 4.5399 5.5018 4.9257 4.6087 5.3599 4.6512 2.8407 1.3615 3.8777 1.1087 5.7489 5.0245 3.4919 5.6384 3.9610 4.8885 3.7790 2.9257 9.8162 6.1165 6.8269 4.5404 3.4222 3.4694 5.5362 3.1716 4.4152 3.5003 3.4427 4.3048 5.2598 6.4853 5.2969 6.0244 2.1727 6.1314 2.1322 3.1159 3.2624 2.4351 2.1935 1.2532 2.3224 1.4434 3.9956 4.4601 1.3830 4.1923 1.9611 3.3255 1.3443 1.3381 2.3277 1.3785 1.3557 1.3246 1.3175 1.4325 1.3202 6.9322 1.4418 2.4276 2.4308 1.6240 2.6911 2.0693 1.8655 1.5960 1.7902 1.0634 1.1364 1.1822 2.9763 1.8731 1.6855 2.0283 2.4757 1.9763 1.9521 2.0370 4.2584 6.0258 6.8263 1.2964 1.2241 3.3053 2.4177 2.6432 2.1577 2.0109 1.9724 1.0914 1.6168 1.0664 1.2006 2.6737 2.6942 6.1647 4.0157 4.0751 6.1080 5.2037 3.8578 3.5480 1.0435 1.0378 1.0931 1.0972 1.0982 1.0953 1.0878 1.0861 1.0885 1.0866 1.0924 1.0921 1.0969 1.0962 1.0973 1.0984 1.0948 1.0794 1.0755
irintensity: 0.0633 0.4619 0.8656 0.4553 1.2876 0.9691 0.7996 2.3243 1.2274 0.2713 0.1814 0.1591 2.5730 3.6276 3.5699 1.2540 0.6392 8.8127 2.5019 3.5522 1.0543 8.4771 2.1281 3.4067 5.1705 11.4040 1.4119 12.9919 2.2594 6.3836 8.7324 3.4300 11.3261 0.5949 19.6683 10.1740 25.3613 10.1163 7.4017 39.5564 13.9972 5.1810 7.1256 61.2050 122.8218 26.0308 19.4200 12.5990 5.5131 114.3567 2.1487 7.2463 5.1494 6.5474 1.1463 12.3207 0.7718 6.2357 0.4970 0.7076 14.3929 4.0806 47.7565 9.9833 7.8531 8.4173 3.0158 8.3491 22.5568 23.5652 0.3472 6.4413 0.1558 9.2602 4.2551 1.8657 114.4185 12.1467 11.2591 187.8036 0.9227 212.5243 40.9912 192.4810 161.9660 29.3269 6.5529 16.6019 52.5136 55.9461 70.3235 34.6540 6.5696 12.8424 33.0200 36.5769 9.2288 222.9430 906.1326 255.7812 45.8679 17.1240 154.6635 172.2069 120.6337 77.8549 87.9502 16.9438 38.8495 17.2453 19.0124 26.7586 22.0647 10.2952 4.2496 11.4881 2.9341 40.4162 11.6980 16.3722 14.3184 20.1241 5.6137 15.0386 237.6702 52.4399
temp: 298.150 k
press: 1.00000 atm
elementType: 17 8 7 7 6 6 6 6 6 6 6 6 6 6 6 6 6 6 6 6 6 6 6 6 6 1 1 1 1 1 1 1 1 1 1 1 1 1 1 1 1 1 1 1
symmnumber: 1
zpe: 909084.7 jmol-1
zpe.correction: 0.346252 hartree
zpe.thermalcorrener: 0.368551 hartree
zpe.thermalcorrenthalpy: 0.369495 hartree
zpe.thermalcorrgfe: 0.292983 hartree
zpe.sumelectzpe: -1454.713715 hartree
zpe.sumelectthermal: -1454.691416 hartree
zpe.sumelectthermalent: -1454.690472 hartree
zpe.sumelectthermalfe: -1454.766984 hartree
dipole: 0.3128 -0.1439 -0.2702
dipole: 0.4377
quadrupole: -135.8747 -136.4211 -158.9251
quadrupole: -3.2034 -0.0352 2.0349
quadrupole: 7.8656 7.3192 -15.1848 -3.2034 -0.0352 2.0349
hfenergy: -1455.0599671 hartree
pointgroup: C01 [X(C21H19Cl1N2O1)]
dipole: -0.1359635 -0.0512625 0.0924092 debye
polarizability: 424.5986131|-18.5588281|318.8468592|-2.0356806|16.0620626|136.9069149 unknown
InChI: InChI=1S/C21H19ClN2O/c1-14-8-7-13-18(15(14)2)23-19-11-5-3-9-16(19)21(25)24-20-12-6-4-10-17(20)22/h3-13,23-24H,1-2H3
charge 0 multiplicity 1
44 atoms
Cl -5.067709 2.294689 -0.632991
O  -0.926155 -0.923018 0.311247
N  1.568563 -0.05278 0.235312
N  -2.599741 0.67813 -0.021779
C  2.881523 -0.425918 -0.162963
C  3.337523 -1.73489 0.197444
C  1.076002 1.210969 0.547601
C  4.62165 -2.167068 -0.24403
C  -0.356729 1.425459 0.618673
C  3.693102 0.425947 -0.95833
C  5.427705 -1.293398 -1.018273
C  2.435303 -2.625266 1.03642
C  4.965723 -0.007999 -1.374364
C  1.940612 2.309032 0.854783
C  5.153196 -3.549345 0.104595
C  -0.841195 2.704547 1.020605
C  -1.293242 0.310822 0.305777
C  1.424826 3.558568 1.224485
C  0.023783 3.77029 1.312486
C  -3.716822 -0.152291 -0.265404
C  -4.967742 0.45643 -0.570081
C  -3.67935 -1.575591 -0.225094
C  -6.133172 -0.280866 -0.822645
C  -4.846364 -2.325973 -0.474732
C  -6.073811 -1.693108 -0.774212
H  0.836821 -0.787636 0.273566
H  3.311935 1.399254 -1.28095
H  6.416617 -1.629866 -1.350151
H  2.035319 -2.075211 1.908329
H  1.559789 -2.98558 0.459085
H  2.966695 -3.514409 1.408168
H  5.587888 0.648733 -1.992602
H  3.021558 2.150383 0.845206
H  6.147128 -3.710208 -0.34637
H  5.25777 -3.686999 1.197951
H  4.485032 -4.351833 -0.260472
H  -1.918166 2.862534 1.156516
H  2.117259 4.370564 1.473734
H  -0.376068 4.738471 1.628239
H  -2.784806 1.679699 -0.128409
H  -2.725796 -2.05651 -0.003145
H  -7.068314 0.238176 -1.051282
H  -4.790633 -3.41903 -0.436963
H  -6.976103 -2.280705 -0.969881
