program: Gaussian 09
title: 000210136
version: EM64L-G09RevD.01
frameworkgroup: C1[X(C10H9N3O3)]
method: RPBEPBE
basis: SDD
operation: Freq
keyword: #p
keyword: freq=noraman
keyword: PBEPBE/SDD
title: #p freq=noraman PBEPBE/SDD
converged: YES YES NO NO
title: Mulliken charges:
elementType: O O O N N N C C C C C C C C C C H H H H H H H H H
charge: -0.251951 -0.396778 -0.374747 -0.275988 -0.230296 -0.013179 0.273717 0.175548 0.110749 -0.005133 -0.298313 -0.335158 0.217510 -0.203899 -0.244211 -0.741788 0.319259 0.285048 0.234563 0.236170 0.368347 0.260960 0.248397 0.261329 0.379847
chargesum: 0.00000
title: Mulliken charges with hydrogens summed into heavy atoms:
elementType: O O O N N N C C C C C C C C C C
charge: -0.251951 -0.016931 -0.006399 -0.275988 -0.230296 -0.013179 0.273717 0.175548 0.110749 -0.005133 0.020945 -0.050110 0.217510 0.030664 -0.008041 0.028897
polarizability: 1.99167624e+02 -7.96881047e+00 1.98544228e+02 5.76703166e-02 4.88769883e-02 5.79076829e+01
1716.lowfreq: -5.3696 -0.0007 -0.0006 -0.0004 4.5409 7.3987 48.0020 66.0743 115.4841
frequency: 48.0002 66.0690 115.4840 127.8950 172.7621 183.2547 198.5211 214.5947 240.9390 265.7390 327.2515 364.2319 376.0834 383.7662 401.2128 418.4953 425.5049 499.1319 529.0575 548.6646 561.9549 596.4556 599.7784 670.0114 678.6359 742.1324 764.6703 776.4000 788.3609 835.9260 885.0338 899.0350 949.6903 973.9036 981.8994 1003.6503 1010.7476 1020.5631 1035.5598 1070.1646 1106.3045 1168.9149 1187.4124 1215.8860 1241.0318 1290.5934 1314.6440 1343.6848 1390.8390 1399.0576 1427.8252 1447.2613 1447.5104 1466.5256 1491.7681 1577.0194 1589.6924 1598.4494 1612.8264 1623.3314 2598.6415 3009.8945 3095.4594 3137.9483 3140.6075 3162.2409 3196.7501 3219.5679 3558.2083
redmass: 4.6217 6.1690 6.3337 4.7608 1.0610 5.9912 7.3682 5.3223 6.8264 6.3567 4.5427 4.5397 6.9317 1.7485 8.9035 5.5459 2.3298 3.6394 8.0145 3.7741 5.1262 3.6793 6.0610 6.1986 4.2121 5.8454 2.5234 1.1610 1.8118 7.3385 7.6440 1.3710 7.0162 1.3750 7.1355 1.3191 2.2921 2.3988 1.6859 3.5467 1.9822 1.1946 2.7015 2.8426 2.9845 2.7494 1.4028 2.9435 1.2333 6.7879 1.0937 2.6386 1.0459 2.9530 10.7318 2.6152 2.9290 2.3539 7.6336 8.2174 1.0720 1.0365 1.0959 1.1025 1.0877 1.0945 1.0960 1.0948 1.0675
irintensity: 5.0982 2.7194 0.6615 1.8196 0.0021 0.4828 10.3655 6.2217 4.0937 1.7930 6.8757 16.9093 1.8474 67.9534 3.5589 4.6847 12.7755 44.7844 4.1465 1.6336 18.9811 0.3625 17.4484 16.8472 0.2994 2.5047 0.2124 238.5526 0.0262 38.4872 35.3850 0.6398 30.4051 7.0629 165.1512 1.4812 39.4081 3.3107 7.1394 48.7591 2.7840 23.1455 107.3008 72.3801 13.8610 246.7559 13.1022 232.5587 55.2884 55.4868 40.9221 109.1443 19.4530 6.9473 12.2986 29.6389 27.9331 91.8738 43.2640 165.8510 81.0316 1.9111 3.3208 15.3433 5.4568 20.3526 3.9829 5.3528 97.5193
temp: 298.150 k
press: 1.00000 atm
elementType: 8 8 8 7 7 7 6 6 6 6 6 6 6 6 6 6 1 1 1 1 1 1 1 1 1
symmnumber: 1
zpe: 471395.2 jmol-1
zpe.correction: 0.179545 hartree
zpe.thermalcorrener: 0.193318 hartree
zpe.thermalcorrenthalpy: 0.194262 hartree
zpe.thermalcorrgfe: 0.139285 hartree
zpe.sumelectzpe: -775.166806 hartree
zpe.sumelectthermal: -775.153033 hartree
zpe.sumelectthermalent: -775.152089 hartree
zpe.sumelectthermalfe: -775.207066 hartree
dipole: 4.0143 1.8227 0.0154
dipole: 4.4088
quadrupole: -87.5375 -88.2072 -94.4321
quadrupole: 5.6576 -0.0433 0.0263
quadrupole: 2.5215 1.8517 -4.3732 5.6576 -0.0433 0.0263
hfenergy: -775.3463514 hartree
pointgroup: C01 [X(C10H9N3O3)]
dipole: -1.408682 -1.008559 0.0840163 debye
dipolederiv: -0.4996534 0.1802879 0.0078561 -0.3067689 -1.2369793 0.0183936 0.0089738 -0.0070463 -0.3299388 -0.6623567 -1.0967198 0.0193306 -0.3495816 -0.6493181 0.0197278 0.0162226 0.0590193 -0.3627829 -0.3262205 -0.2111228 -0.0018949 0.7673024 -0.8092885 -0.042738 -0.0043217 0.0140418 -0.3579898 -1.4142443 -0.573669 0.0719738 -0.2534441 -1.1660584 0.0145869 0.0698133 0.0318029 -0.0894521 0.196267 1.0812005 -0.0222057 0.1710638 0.009975 -0.0090075 -0.0183184 -0.0572471 -0.1615933 0.0728504 0.1524144 -0.011484 -0.7405519 0.3983203 0.0406864 -0.0099051 -0.011239 -0.1201055 1.1306769 0.1296383 -0.0581039 -0.2304837 0.0331195 0.012129 -0.0565891 -0.0063495 0.0688323 -0.2851549 0.366659 0.0145602 -0.0636615 -0.3127787 0.0043306 0.0156517 -0.0190465 0.0039891 0.4614927 -0.5862464 -0.0172165 -0.0829005 0.2898543 0.003262 -0.018861 0.0309003 0.1230364 -0.3046905 0.0721044 0.0193811 -0.1703714 0.8137471 0.0087883 0.0211878 -0.0059458 0.0536526 -0.5076912 0.0657749 0.0190051 0.2238419 0.0048828 -0.0127351 0.0189216 -0.0041717 -0.1522262 0.0840243 -0.2915611 -0.0101078 0.0689778 0.1403465 -0.0045483 -0.0112086 0.0151762 -0.1165273 1.2695527 0.4919767 -0.0556073 0.8157374 1.8297686 -0.0466532 -0.0567112 -0.0298161 0.187782 0.2326645 0.0394755 -0.0198375 0.0139717 0.2024372 -0.002076 -0.0196796 -0.0034399 -0.1288669 0.0768415 0.0432547 -0.0136746 -0.0098942 -0.3696964 0.0010853 -0.0132668 -0.0016058 -0.1697749 -0.4371556 0.018608 0.0227254 0.1224583 0.0001935 -0.0061376 0.023519 -0.0002251 0.0005012 0.152484 -0.0430086 0.0020605 -0.0020929 0.0704522 0.0005734 0.0018542 0.0027067 0.185042 0.0972801 -0.0223878 0.0039209 -0.0635196 0.0100758 0.0039361 0.0040209 0.0015722 0.1680642 0.0115514 0.0929926 0.0073669 0.1054434 -0.0289366 -0.0050712 0.0072234 -0.0043471 0.152458 -0.1197442 -0.0039426 0.0155218 -0.0245147 0.0833449 0.0015948 0.015479 0.0004823 0.1638411 0.3146575 0.0101382 0.0023803 -0.0577616 0.2383756 0.0033753 0.0026176 -0.0008972 0.3478684 0.0911758 0.0058859 -0.0011367 0.0432831 0.101761 0.0817485 -0.0144006 0.0747976 0.0055058 0.0523756 -0.0402593 0.00355 -0.137776 -0.0781578 0.0067136 0.0031183 0.0017346 0.1264994 0.0919229 -0.0018983 -0.0075567 0.0347135 0.1025739 -0.0852583 0.0054076 -0.0744888 0.0048758 0.221094 0.1204046 0.0091931 0.1265291 0.3219856 -0.0067065 0.0092512 -0.0063679 0.3973096 unknown
polarizability: 201.7396656|-7.2622314|195.5474289|-7.8104995|0.0917399|58.3324401 unknown
InChI: InChI=1S/C10H9N3O3/c1-6(14)13-8-5-3-2-4-7(8)9(11-15)10(13)12-16/h2-5,15-16H,1H3
charge 0 multiplicity 1
25 atoms
O  1.132443 3.084998 -0.210376
O  -1.313203 -3.372201 -0.063563
O  2.522134 -2.454498 -0.27886
N  0.769281 0.788785 -0.186521
N  -0.020751 -2.719778 -0.134082
N  2.386734 -1.043189 -0.274853
C  -0.665608 0.871163 -0.109118
C  -1.228887 -0.445845 -0.074271
C  -0.124317 -1.389922 -0.13173
C  1.130483 -0.605057 -0.203373
C  -1.494754 2.010472 -0.068062
C  -2.627718 -0.638602 0.002825
C  1.634254 1.927106 -0.232996
C  -2.892432 1.800281 0.009097
C  -3.458744 0.500086 0.04452
C  3.127459 1.6940 -0.307474
H  -1.06451 3.010518 -0.095222
H  -3.037777 -1.649965 0.028189
H  -3.551802 2.67471 0.041834
H  -4.545337 0.381662 0.104023
H  1.578098 -2.902557 -0.223793
H  3.492405 1.107268 0.552461
H  3.611058 2.681734 -0.3298
H  3.404784 1.111131 -1.202119
H  -1.084692 -4.338001 -0.07374
