program: Gaussian 09
title: 000210148
version: EM64L-G09RevD.01
frameworkgroup: C1[X(C18H20N2O)]
method: RPBEPBE
basis: SDD
operation: Freq
keyword: #p
keyword: freq=noraman
keyword: PBEPBE/SDD
title: #p freq=noraman PBEPBE/SDD
converged: YES YES NO NO
title: Mulliken charges:
elementType: O N N C C C C C C C C C C C C C C C C C C H H H H H H H H H H H H H H H H H H H H
charge: -0.275511 -0.435400 0.000257 0.449732 -0.503867 -0.579782 -0.420259 -0.435730 -0.660930 0.502623 0.148429 -0.399787 -0.404005 0.252152 -0.240433 -0.243032 -0.245695 -0.297936 -0.439978 -0.188592 -0.326374 0.207170 0.277009 0.241452 0.212596 0.208651 0.230043 0.214148 0.216426 0.264459 0.206239 0.311819 0.251492 0.223137 0.228087 0.223669 0.228103 0.237467 0.282872 0.233531 0.245748
chargesum: 0.00000
title: Mulliken charges with hydrogens summed into heavy atoms:
elementType: O N N C C C C C C C C C C C C C C C C C C
charge: -0.275511 -0.123581 0.000257 0.449732 -0.019688 -0.125733 0.018434 -0.005156 -0.190233 0.502623 0.148429 -0.148296 -0.180869 0.252152 -0.012346 -0.019363 -0.017592 -0.060469 -0.157106 0.044940 -0.080626
polarizability: 2.22947248e+02 2.45574166e+01 2.02622727e+02 -5.36599448e+00 3.05247030e+00 1.69418189e+02
1716.lowfreq: -4.8994 -2.3890 -0.0004 0.0005 0.0007 8.4137 21.6494 27.9683 38.4393
frequency: 21.5064 27.7336 38.3638 64.1474 69.0197 77.2225 80.2592 112.6813 144.4257 170.9639 193.0035 211.7370 255.0143 276.3452 313.3016 361.5733 372.4557 392.3844 406.5597 413.1409 448.1137 469.0723 507.8017 535.8325 569.0522 611.1053 618.1772 630.8680 646.2840 682.3218 709.2634 709.5358 723.6081 738.6924 774.1100 799.4942 811.3469 818.1934 826.0966 853.2440 859.6701 885.1884 896.5443 922.5742 932.4142 933.3713 957.1955 968.6347 979.8633 987.1106 989.9732 996.1824 999.7367 1010.9576 1026.9120 1028.0241 1034.2314 1047.1355 1075.7122 1093.1530 1109.4039 1121.4729 1138.7396 1170.8902 1175.9193 1188.9579 1194.5625 1198.7533 1201.9679 1218.8478 1223.3228 1254.1336 1275.0031 1284.2049 1298.1114 1306.9173 1308.2934 1317.2319 1324.6382 1326.7267 1334.2870 1382.4486 1403.7513 1440.4570 1447.9857 1462.2353 1469.5582 1473.3556 1480.6115 1483.5127 1484.5465 1495.3160 1545.0584 1579.8278 1590.1534 1592.7109 1613.6903 2992.3530 2994.6584 2999.6465 3002.4150 3016.9626 3043.8613 3058.5779 3063.2363 3076.4632 3095.3513 3111.3591 3119.9878 3125.1070 3131.7891 3136.0327 3142.5099 3152.7433 3161.1330 3166.8796 3533.8497
redmass: 5.5459 4.4777 4.2889 4.9302 4.1378 2.0803 3.2996 4.2921 3.7846 4.6503 2.8195 3.8954 4.3722 4.0995 4.3690 3.0309 2.8610 2.7231 2.9120 3.7220 2.5836 3.9663 3.7500 1.2395 4.9329 7.3677 6.1799 3.1758 3.0662 4.4733 1.8242 5.2371 1.7984 1.6997 1.9606 2.2131 2.2183 2.3818 2.0918 4.1639 1.3313 2.7210 2.0506 1.6707 1.4622 1.5444 1.5139 2.1148 1.3808 1.4267 5.8385 1.5701 2.0055 2.3498 2.2709 3.0300 1.6928 2.8583 1.7222 1.9806 1.7737 2.0507 2.1503 1.0954 1.2924 1.1233 1.3805 1.5157 1.4012 2.5939 1.1757 1.5904 1.6135 1.5396 1.4085 8.6965 1.4475 1.6111 1.2806 1.4031 1.3985 6.9862 2.1300 2.1265 1.8583 1.3194 1.1185 1.1129 1.1172 2.0428 1.4935 1.1883 5.3128 5.8562 6.2197 6.4070 6.1211 1.0595 1.0624 1.0642 1.0628 1.0655 1.1002 1.1032 1.1016 1.1022 1.0996 1.0870 1.0865 1.0887 1.0914 1.0907 1.0959 1.0923 1.1014 1.0998 1.0770
irintensity: 0.1623 3.2186 0.2102 2.4225 0.1517 0.1683 1.8645 2.5078 1.5334 4.3999 2.1022 2.4744 0.4787 2.7442 8.4496 1.8557 0.9569 0.6695 0.3450 7.8907 2.0017 4.3448 8.7295 88.1636 6.0914 1.7450 0.2765 5.5096 12.6560 10.3471 55.2054 12.7219 63.0159 12.2325 23.3521 1.3160 11.5753 3.8930 8.4081 12.7502 1.2047 1.8535 3.1223 1.6206 4.3112 1.0465 3.2759 3.5756 0.2509 0.9028 0.0331 0.7962 3.9855 10.7829 6.2813 0.2416 1.6118 4.7705 9.3454 3.6429 12.1602 0.4421 6.6663 0.2709 3.6133 1.1678 2.0580 10.0156 4.8325 0.6872 4.1033 65.1565 36.0768 33.0161 4.5305 0.0623 0.7041 22.1371 2.1597 13.6713 3.8199 0.0245 21.6561 2.8087 78.0778 60.1324 11.7419 14.0187 39.6796 30.5623 122.1258 21.9405 18.5190 24.0182 55.4902 53.4246 7.5928 16.8911 8.9340 56.1301 53.8735 38.4112 12.9317 2.7317 5.6924 79.8388 29.1887 11.2698 1.7612 5.5497 11.8283 18.3904 40.2837 4.7160 23.6573 22.4179 12.0954
temp: 298.150 k
press: 1.00000 atm
elementType: 8 7 7 6 6 6 6 6 6 6 6 6 6 6 6 6 6 6 6 6 6 1 1 1 1 1 1 1 1 1 1 1 1 1 1 1 1 1 1 1 1
symmnumber: 1
zpe: 892122.0 jmol-1
zpe.correction: 0.339791 hartree
zpe.thermalcorrener: 0.358330 hartree
zpe.thermalcorrenthalpy: 0.359274 hartree
zpe.thermalcorrgfe: 0.290809 hartree
zpe.sumelectzpe: -881.134946 hartree
zpe.sumelectthermal: -881.116407 hartree
zpe.sumelectthermalent: -881.115463 hartree
zpe.sumelectthermalfe: -881.183928 hartree
dipole: 1.9563 1.8793 -5.0333
dipole: 5.7178
quadrupole: -124.0089 -121.0964 -126.5845
quadrupole: 0.3329 9.6990 0.4577
quadrupole: -0.1123 2.8002 -2.6879 0.3329 9.6990 0.4577
hfenergy: -881.4747373 hartree
pointgroup: C01 [X(C18H20N2O1)]
dipole: -0.8501164 -0.6581591 -1.9760163 debye
polarizability: 224.6713528|23.6785698|201.3658907|4.3247968|-2.9761341|168.9509208 unknown
InChI: InChI=1S/C18H20N2O/c21-17(16-9-6-12-19-14-16)20-18(10-4-5-11-18)13-15-7-2-1-3-8-15/h1-3,6-9,12,14,20H,4-5,10-11,13H2
charge 0 multiplicity 1
41 atoms
O  0.966346 -0.747908 1.992869
N  0.020347 -0.900356 -0.140125
N  4.354308 1.250507 0.423075
C  -1.306565 -1.45257 0.264095
C  -1.117862 -2.843682 0.939463
C  -2.056467 -1.836815 -1.042695
C  -0.803906 -3.825755 -0.223915
C  -1.403328 -3.168327 -1.515451
C  -2.080783 -0.450673 1.18423
C  -2.271177 0.936046 0.589348
C  1.053023 -0.604442 0.729001
C  -1.317184 1.959735 0.832213
C  -3.391646 1.242418 -0.227203
C  2.317121 -0.081073 0.090522
C  -1.469803 3.245261 0.265433
C  -3.549958 2.526796 -0.795145
C  -2.586125 3.533424 -0.553766
C  2.720143 -0.382536 -1.235159
C  3.178763 0.729695 0.876867
C  3.936916 0.144086 -1.720166
C  4.715236 0.955544 -0.862921
H  -2.072073 -3.112951 1.43211
H  -0.337212 -2.815325 1.715857
H  -2.031701 -1.037157 -1.806422
H  -3.119287 -2.003065 -0.786922
H  -1.233665 -4.824847 -0.031868
H  0.287181 -3.959045 -0.331304
H  -0.605516 -2.975747 -2.256558
H  -2.14392 -3.821113 -2.010535
H  -1.522129 -0.383756 2.134856
H  -3.062099 -0.913756 1.403595
H  0.103355 -0.578883 -1.106788
H  -0.46073 1.747362 1.483699
H  -4.152033 0.472256 -0.40941
H  -0.724046 4.022167 0.469264
H  -4.426087 2.744875 -1.416809
H  -2.709153 4.531519 -0.989226
H  2.119484 -1.0436 -1.871239
H  2.905784 0.952986 1.913461
H  4.28382 -0.076043 -2.734492
H  5.666323 1.38215 -1.201342
