program: Gaussian 09
title: 000210141
version: EM64L-G09RevD.01
frameworkgroup: C1[X(C19H16F3NO)]
method: RPBEPBE
basis: SDD
operation: Freq
keyword: #p
keyword: freq=noraman
keyword: PBEPBE/SDD
title: #p freq=noraman PBEPBE/SDD
converged: YES YES NO NO
title: Mulliken charges:
elementType: F F F O N C C C C C C C C C C C C C C C C C C C H H H H H H H H H H H H H H H H
charge: -0.164594 -0.170834 -0.170460 -0.271482 -0.378153 -0.061292 -0.529427 0.532735 -0.698934 -0.506456 -0.395804 0.294873 -0.233588 -0.385166 0.245388 0.197219 -0.171874 0.356599 0.028609 -0.393023 -0.376285 -0.214820 -0.216605 -0.233826 0.253036 0.234094 0.205089 0.243072 0.200899 0.218847 0.257812 0.302802 0.282570 0.242340 0.266397 0.247918 0.258393 0.233660 0.235101 0.235169
chargesum: 0.00000
title: Mulliken charges with hydrogens summed into heavy atoms:
elementType: F F F O N C C C C C C C C C C C C C C C C C C C
charge: -0.164594 -0.170834 -0.170460 -0.271482 -0.075351 0.191745 -0.090244 0.532735 -0.036116 -0.248644 -0.113234 0.294873 0.008751 -0.118769 0.245388 0.197219 -0.171874 0.356599 0.028609 -0.145106 -0.117892 0.018840 0.018495 0.001343
polarizability: 2.77394056e+02 5.42282323e+01 2.17784738e+02 -1.38194844e+01 2.33067724e+00 1.95108767e+02
1716.lowfreq: -10.4822 -4.5906 -2.0655 0.0003 0.0006 0.0007 6.0742 9.3197 11.8244
frequency: -10.1296 7.1165 11.3262 22.7703 34.3619 57.9604 64.6338 86.6317 103.3218 121.6020 127.9262 159.2819 196.1143 209.4297 214.2454 231.7865 250.7798 266.7860 301.0993 317.2841 333.7560 372.0656 388.1275 399.9906 423.2593 427.9086 455.3118 469.1349 491.8326 525.1809 545.1460 549.9719 570.8315 586.9788 595.4926 607.7873 618.0791 619.5147 695.3818 699.4630 704.7604 706.2924 753.7005 776.2261 798.6012 833.3756 854.9046 855.6827 893.2190 915.4517 929.2317 933.8400 944.3974 967.7999 979.5375 983.1357 987.1267 987.4920 1001.5692 1002.9427 1007.3382 1025.5781 1052.4221 1080.6457 1082.4598 1092.2324 1116.6775 1152.4723 1175.2798 1175.7786 1189.5106 1193.6230 1203.2119 1229.9934 1286.7438 1295.1152 1304.9962 1313.2747 1318.1712 1345.1793 1352.3842 1370.6892 1387.7048 1391.7764 1433.5419 1438.7241 1451.3167 1462.7376 1474.4482 1478.7006 1484.3592 1488.2900 1562.4420 1574.0249 1601.5191 1607.9036 1619.6287 2238.2217 2963.4023 2979.0407 3009.4516 3042.9375 3075.8796 3095.8808 3132.1399 3132.3984 3136.0843 3140.8913 3152.6628 3154.8071 3162.3314 3172.9767 3176.6779 3535.9129
redmass: 16.7669 8.8642 3.7678 5.7829 5.3807 5.2848 6.2898 4.8106 5.6113 5.5739 5.1170 4.7133 3.9409 1.7934 2.0723 3.5998 4.9293 5.3466 6.3361 3.5831 7.1531 5.1371 5.2489 2.8224 3.6607 3.9800 4.9188 3.3497 6.2580 7.9398 5.2386 4.3155 1.6043 3.2828 8.1149 9.5259 6.5322 5.0540 1.8515 3.2791 4.7002 6.7346 6.3825 1.7405 1.4893 3.5105 1.2484 1.9499 1.5837 2.6787 1.8309 1.4272 1.5007 2.5850 7.4662 1.3858 5.9845 4.6591 1.4871 1.3287 6.2123 2.1234 3.1265 1.6187 2.8634 2.3667 1.7939 2.3477 1.1797 1.6119 1.1506 1.4286 1.3544 1.5599 1.9840 2.5285 2.2295 1.3890 1.3094 1.4821 1.4420 5.7029 1.7886 2.3835 2.3331 2.1164 1.2931 1.3505 1.0561 1.5628 2.1323 2.2731 5.9129 5.6695 5.7786 6.0345 6.0667 11.9965 1.0599 1.0372 1.0981 1.0870 1.0977 1.1000 1.0851 1.0919 1.0897 1.0882 1.0931 1.0926 1.0971 1.1017 1.0975 1.0777
irintensity: 0.0983 0.6592 0.0334 0.9776 1.9574 2.7976 9.3181 0.9445 0.8995 0.1297 0.4125 3.2213 0.5971 6.6847 2.2372 4.5619 2.7570 1.5295 0.4248 1.8820 8.9447 1.4629 4.1912 0.0101 0.4374 1.5390 4.8544 5.6802 2.7010 1.9461 0.2369 3.4057 121.3516 26.2309 15.9679 6.1432 0.6481 8.3520 44.4362 25.7964 15.7332 17.1920 2.1912 62.9774 70.0462 30.3791 0.0539 12.2679 7.9270 6.3478 20.9292 5.2203 3.2186 18.9702 198.6485 0.0962 1.7563 16.3190 0.2612 0.1375 166.9930 10.5740 123.2440 7.6790 6.6637 11.0749 8.6752 22.0351 43.0578 139.2766 2.8498 18.9012 48.7416 78.4408 124.6543 94.1181 109.7967 0.1485 2.1276 71.6608 4.1604 0.0841 14.9414 6.2141 12.0275 30.4519 49.3216 144.5273 11.3294 0.3813 162.9508 34.3361 192.8674 4.6124 11.4912 4.1828 4.7977 227.0717 23.7067 35.8188 11.2881 5.8211 44.2600 27.9517 0.8403 3.0181 3.9858 2.6920 16.7171 4.3375 24.0299 18.9567 5.0692 20.4564
temp: 298.150 k
press: 1.00000 atm
elementType: 9 9 9 8 7 6 6 6 6 6 6 6 6 6 6 6 6 6 6 6 6 6 6 6 1 1 1 1 1 1 1 1 1 1 1 1 1 1 1 1
symmnumber: 1
zpe: 790082.9 jmol-1
zpe.correction: 0.300927 hartree
zpe.thermalcorrener: 0.322527 hartree
zpe.thermalcorrenthalpy: 0.323471 hartree
zpe.thermalcorrgfe: 0.245422 hartree
zpe.sumelectzpe: -1161.392483 hartree
zpe.sumelectthermal: -1161.370883 hartree
zpe.sumelectthermalent: -1161.369939 hartree
zpe.sumelectthermalfe: -1161.447988 hartree
dipole: -3.7028 1.4917 -2.3226
dipole: 4.6185
quadrupole: -137.5552 -139.0717 -130.7766
quadrupole: 26.5642 6.4776 -11.2096
quadrupole: -1.7540 -3.2705 5.0246 26.5642 6.4776 -11.2096
hfenergy: -1161.69341 hartree
pointgroup: C01 [X(C19H16F3N1O1)]
dipole: -1.3245702 -0.9424635 0.8117731 debye
polarizability: 297.9800985|-28.3460886|193.2028469|25.7955841|3.1108949|199.1046164 unknown
InChI: InChI=1S/C19H16F3NO/c1-14(12-16-8-5-9-17(13-16)19(20,21)22)23-18(24)11-10-15-6-3-2-4-7-15/h2-9,13-14,23H,12H2,1H3
charge 0 multiplicity 1
40 atoms
F  4.210834 4.363042 -0.209634
F  3.159365 3.781106 1.714946
F  5.304892 3.156957 1.371702
O  0.226614 -2.670183 -1.48422
N  0.530642 -2.126731 0.772166
C  1.900674 -2.668609 0.864631
C  2.92595 -1.571564 1.25628
C  2.994267 -0.345234 0.351049
C  1.951909 -3.849449 1.860875
C  3.445369 0.880798 0.893291
C  2.669664 -0.392128 -1.03113
C  3.579362 2.028005 0.076466
C  2.804238 0.755681 -1.842485
C  3.261551 1.974618 -1.298585
C  4.051683 3.303074 0.709423
C  -0.22364 -2.185228 -0.393517
C  -1.567941 -1.646286 -0.274289
C  -4.070833 -0.712666 -0.319907
C  -2.727957 -1.211732 -0.292247
C  -4.641058 -0.085987 0.82704
C  -4.855494 -0.838357 -1.504587
C  -5.96293 0.401111 0.786301
C  -6.176595 -0.349098 -1.535779
C  -6.735083 0.271387 -0.392753
H  2.127246 -3.049967 -0.146885
H  3.923486 -2.057187 1.281512
H  2.725957 -1.246199 2.297736
H  1.242846 -4.639119 1.559599
H  1.692805 -3.521759 2.886017
H  2.965937 -4.287822 1.892326
H  3.697922 0.943939 1.958603
H  0.104811 -1.713119 1.605067
H  2.291473 -1.316527 -1.481342
H  2.543058 0.69918 -2.904078
H  3.365602 2.865508 -1.924502
H  -4.040105 0.013412 1.736984
H  -4.417358 -1.318669 -2.385449
H  -6.392386 0.882202 1.671643
H  -6.771373 -0.450052 -2.449918
H  -7.762201 0.651149 -0.420749
