program: Gaussian 09
title: 000210106
version: EM64L-G09RevD.01
frameworkgroup: C1[X(C11H15N3O2)]
method: RPBEPBE
basis: SDD
operation: Freq
keyword: #p
keyword: freq=noraman
keyword: PBEPBE/SDD
title: #p freq=noraman PBEPBE/SDD
converged: YES YES NO NO
title: Mulliken charges:
elementType: O O N N N C C C C C C C C C C C H H H H H H H H H H H H H H H
charge: -0.245419 -0.267634 -0.103608 -0.380211 -0.000763 -0.339641 -0.349648 -0.314566 -0.312567 -0.324952 0.171536 0.252038 -0.278325 -0.426217 -0.192021 -0.321401 0.221034 0.207495 0.203155 0.210459 0.220842 0.187464 0.191258 0.217052 0.247627 0.222471 0.306994 0.229341 0.286478 0.234848 0.246879
chargesum: 0.00000
title: Mulliken charges with hydrogens summed into heavy atoms:
elementType: O O N N N C C C C C C C C C C C
charge: -0.245419 -0.267634 -0.103608 -0.073217 -0.000763 0.088888 0.063965 0.093740 0.095742 0.145146 0.171536 0.252038 -0.048984 -0.139739 0.042828 -0.074522
polarizability: 1.93373367e+02 1.22937622e+01 1.34389707e+02 1.23637583e+01 -1.16259744e+01 1.01284976e+02
1716.lowfreq: -17.7207 -8.1524 -1.8289 0.0006 0.0008 0.0008 19.3466 31.7151 43.5315
frequency: 17.8461 31.6866 43.4158 46.4787 112.2811 131.7477 206.5099 213.6425 243.4170 255.5740 291.2477 322.1683 375.5388 386.3828 397.0419 422.3690 467.4034 469.1482 514.2389 582.4103 607.9200 618.7198 682.6616 702.1005 721.5510 757.6010 802.0785 820.7877 825.3500 841.4923 896.5527 932.1590 959.1803 983.4100 988.1244 995.8437 1012.3736 1023.8443 1033.0518 1053.4654 1059.9074 1083.9409 1103.5747 1118.6787 1124.9606 1152.8718 1163.8666 1189.3378 1201.3968 1227.7466 1259.8612 1268.6751 1284.9347 1294.1247 1306.5533 1327.1524 1330.1394 1342.4992 1360.7450 1369.3142 1388.6268 1403.8947 1443.7270 1449.4157 1450.9524 1451.6601 1461.4774 1479.8746 1491.7732 1545.6707 1580.3216 1599.7147 2884.9528 2894.5816 2945.0443 2952.3890 2956.0180 3016.2332 3024.3667 3041.8004 3083.4113 3087.0686 3123.0057 3136.3299 3156.1906 3168.0692 3554.8238
redmass: 4.9511 5.6883 3.1948 6.7529 4.6412 4.1016 3.5347 3.7833 3.9682 2.2680 4.0711 2.3854 3.6189 2.6240 2.5091 4.7870 3.7605 3.3195 2.8690 1.8200 4.2131 1.7992 5.8334 6.5038 1.7268 3.9672 4.0575 2.1162 2.9479 1.6539 2.5678 1.3602 1.4935 2.5679 1.6968 2.7871 4.0284 2.2080 2.6193 2.0881 2.2576 3.5685 2.2596 1.8057 2.5668 2.9028 2.5207 1.0714 1.2788 1.1396 1.8787 1.3462 1.4323 1.3680 9.7275 1.2640 1.2745 1.2552 1.4233 1.2651 1.3650 2.1323 1.0827 1.8755 1.0970 1.1049 1.1078 1.2370 1.6809 5.5282 5.6971 7.4894 1.0692 1.0689 1.0616 1.0668 1.0667 1.0998 1.0912 1.0909 1.0959 1.0974 1.0892 1.0903 1.0924 1.0996 1.0770
irintensity: 5.3344 1.0747 0.2739 2.4659 1.8623 1.1364 11.3144 9.3689 1.5276 0.7942 8.1155 8.5413 1.5315 3.0724 5.3362 6.9764 0.8297 0.7979 34.9759 43.0112 10.3288 53.0905 3.5062 2.0843 59.6118 4.6373 11.4147 22.5105 12.4593 0.2312 21.8358 1.6404 4.5269 18.0937 5.8231 29.3238 15.3132 12.7505 0.5251 16.8565 10.8603 63.1381 18.4296 8.8161 116.0463 27.0823 4.8898 1.7636 4.7222 5.4853 63.4585 44.2322 104.7358 17.4212 2.3336 2.8503 0.9067 6.3989 11.8389 1.8071 6.3417 18.1800 1.5631 54.4431 1.6432 13.3153 7.5392 79.5514 207.0184 19.7624 30.0742 147.4392 65.4499 74.1045 39.3485 25.5731 111.4877 16.1233 58.6353 33.1142 39.9135 31.9669 9.2459 16.4800 3.5996 21.0179 15.0552
temp: 298.150 k
press: 1.00000 atm
elementType: 8 8 7 7 7 6 6 6 6 6 6 6 6 6 6 6 1 1 1 1 1 1 1 1 1 1 1 1 1 1 1
symmnumber: 1
zpe: 664707.9 jmol-1
zpe.correction: 0.253174 hartree
zpe.thermalcorrener: 0.267692 hartree
zpe.thermalcorrenthalpy: 0.268636 hartree
zpe.thermalcorrgfe: 0.209011 hartree
zpe.sumelectzpe: -741.640575 hartree
zpe.sumelectthermal: -741.626057 hartree
zpe.sumelectthermalent: -741.625113 hartree
zpe.sumelectthermalfe: -741.684737 hartree
dipole: -1.5926 3.0203 -3.7383
dipole: 5.0629
quadrupole: -112.4383 -93.8768 -94.3765
quadrupole: 16.7267 0.9585 2.5247
quadrupole: -12.2078 6.3537 5.8540 16.7267 0.9585 2.5247
hfenergy: -741.8937486 hartree
pointgroup: C01 [X(C11H15N3O2)]
dipole: -0.6410465 0.9098841 -1.6519377 debye
polarizability: 192.7279694|15.5128839|130.1673918|10.6418707|-16.232872|106.1526895 unknown
InChI: InChI=1S/C11H15N3O2/c15-11(10-2-1-3-12-8-10)13-9-14-4-6-16-7-5-14/h1-3,8,13H,4-7,9H2
charge 0 multiplicity 1
31 atoms
O  -4.806757 1.034286 0.517385
O  0.975845 -1.77916 1.291699
N  -2.409361 -0.352471 -0.326889
N  -0.038384 -0.74459 -0.535554
N  4.685605 0.052623 0.432077
C  -2.449163 0.395723 0.95832
C  -3.75611 -0.877704 -0.672538
C  -3.465808 1.543014 0.854701
C  -4.753034 0.29188 -0.752167
C  -1.348575 -1.380463 -0.363262
C  1.025509 -0.946059 0.332728
C  2.263005 -0.125163 0.066233
C  2.269484 1.107168 -0.635623
C  3.497683 -0.598631 0.586207
C  3.489991 1.797123 -0.800744
C  4.667519 1.233808 -0.257294
H  -1.443643 0.803757 1.169275
H  -2.732749 -0.274552 1.805789
H  -4.122021 -1.614449 0.083955
H  -3.706031 -1.387798 -1.65383
H  -3.581932 2.061586 1.820302
H  -3.134288 2.266245 0.078168
H  -4.454347 0.976541 -1.575458
H  -5.779348 -0.071769 -0.924664
H  -1.276571 -1.995713 0.560413
H  -1.563301 -2.053681 -1.215698
H  0.051697 -0.103693 -1.325464
H  1.342847 1.548491 -1.022365
H  3.514484 -1.535783 1.151888
H  3.530667 2.754926 -1.328419
H  5.633986 1.739607 -0.362771
