program: Gaussian 09
title: 000210102
version: EM64L-G09RevD.01
frameworkgroup: C1[X(C14H14N2)]
method: RPBEPBE
basis: SDD
operation: Freq
keyword: #pfreq=noraman
keyword: PBEPBE/SDD
title: #p freq=noraman PBEPBE/SDD
converged: YES YES NO NO
title: Mulliken charges:
elementType: N N C C C C C C C C C C C C C C H H H H H H H H H H H H H H
charge: -0.213692 -0.027091 -0.392638 -0.551428 0.341028 0.224155 -0.464423 -0.381933 -0.395734 0.116557 -0.221082 -0.265294 -0.310656 -0.189926 -0.364567 -0.177204 0.229432 0.220545 0.233341 0.231735 0.240919 0.236870 0.227445 0.233786 0.218613 0.221946 0.270154 0.238510 0.239726 0.230906
chargesum: 0.00000
title: Mulliken charges with hydrogens summed into heavy atoms:
elementType: N N C C C C C C C C C C C C C C
charge: -0.213692 -0.027091 0.057339 -0.086353 0.341028 0.224155 0.013366 -0.154488 -0.161948 0.116557 -0.002469 -0.043348 -0.040502 0.048584 -0.124841 0.053703
polarizability: 2.28165901e+02 -8.61471753e+00 1.34498333e+02 1.13274521e+01 6.43415031e+00 1.14597783e+02
1716.lowfreq: -7.9153 -3.6431 -0.0006 -0.0006 -0.0004 7.1483 16.2670 34.0434 50.3129
frequency: 15.4164 33.8679 50.2360 134.1869 147.0135 170.0131 217.9125 236.3153 289.4728 316.2380 404.7334 416.3160 436.0722 457.0883 530.4681 537.4183 575.1563 601.9441 619.7198 647.8895 712.6712 736.6825 748.2295 751.9309 762.2360 791.2890 811.6934 838.9808 856.2445 905.8764 918.6092 933.2501 962.7528 963.1403 964.0590 994.2678 1007.9934 1021.4505 1035.8203 1039.4234 1054.7999 1082.1028 1085.3192 1153.2772 1156.7659 1161.2005 1171.1670 1188.8622 1203.2558 1226.9675 1244.0777 1268.4185 1280.9936 1296.0992 1300.7191 1313.3803 1350.2122 1373.1156 1409.9386 1415.5624 1443.2500 1451.4695 1457.8838 1459.6703 1482.4150 1505.9492 1565.7093 1582.7498 1597.6175 1622.2489 2917.6458 2942.1268 2983.5918 3034.7990 3040.6713 3062.6089 3120.5750 3126.3939 3127.3133 3136.9493 3143.9515 3156.9203 3162.5357 3169.7327
redmass: 4.4197 4.2950 4.1520 2.7667 2.5702 4.5582 3.3609 3.2559 4.5260 2.8370 3.3656 2.8390 3.2566 3.0315 4.5145 3.9616 5.6468 6.4796 5.1863 3.9472 2.3752 3.1233 1.7256 3.9977 1.2285 2.4244 3.8430 1.4564 2.1561 1.3267 1.4358 1.8146 1.3284 3.8636 1.7896 2.5399 1.3527 2.5092 2.3116 2.3657 1.6943 1.9425 2.0717 1.5643 1.1248 1.4261 1.0790 1.5988 1.5183 2.2229 1.6164 1.4576 1.6115 1.7273 1.6255 4.3487 1.4821 2.5284 3.0718 1.9917 1.3607 2.3868 1.5959 1.2089 1.6351 1.6935 5.9700 5.8077 6.8544 7.1803 1.0709 1.0673 1.0663 1.0913 1.0912 1.0982 1.0854 1.0878 1.0894 1.0896 1.0936 1.0940 1.0999 1.1014
irintensity: 0.2462 1.2269 0.3908 1.5393 1.6603 3.1725 4.4620 8.6892 18.7602 1.7424 4.2794 4.8776 3.0403 5.6925 0.9579 2.2642 9.8855 6.9299 4.6407 1.6454 12.8609 9.1852 86.5297 3.1842 55.8423 5.6460 0.8736 5.8263 17.7208 2.7261 2.9082 10.5800 0.0719 2.0346 2.8017 13.7260 1.3346 12.6097 6.2442 5.8883 3.5055 2.4948 3.1142 9.3273 1.4345 0.7953 3.6867 6.9687 0.5108 23.1325 43.2171 1.2043 21.7324 70.9856 9.6788 24.0089 22.6877 15.5060 27.2572 30.3775 60.4816 16.7015 13.7530 9.1389 90.9844 97.3013 13.6123 53.6924 3.0840 110.7613 88.1091 45.1418 31.1250 6.6682 44.6841 28.3351 8.7014 14.1361 12.9778 10.9430 38.6893 19.6300 26.4502 24.0931
temp: 298.150 k
press: 1.00000 atm
elementType: 7 7 6 6 6 6 6 6 6 6 6 6 6 6 6 6 1 1 1 1 1 1 1 1 1 1 1 1 1 1
symmnumber: 1
zpe: 643741.0 jmol-1
zpe.correction: 0.245188 hartree
zpe.thermalcorrener: 0.258169 hartree
zpe.thermalcorrenthalpy: 0.259113 hartree
zpe.thermalcorrgfe: 0.203471 hartree
zpe.sumelectzpe: -650.253649 hartree
zpe.sumelectthermal: -650.240668 hartree
zpe.sumelectthermalent: -650.239724 hartree
zpe.sumelectthermalfe: -650.295365 hartree
dipole: -1.2493 1.5725 1.3695
dipole: 2.4309
quadrupole: -86.8312 -88.9531 -95.7751
quadrupole: 0.5953 -5.7569 -0.0127
quadrupole: 3.6886 1.5667 -5.2553 0.5953 -5.7569 -0.0127
hfenergy: -650.4988367 hartree
pointgroup: C01 [X(C14H14N2)]
dipole: -0.5326669 -0.3942837 -0.6895397 debye
polarizability: 228.0550578|8.9914263|127.7945672|-11.8513192|11.0871275|121.4123929 unknown
InChI: InChI=1S/C14H14N2/c1-2-7-14-12(5-1)8-10-16(14)11-13-6-3-4-9-15-13/h1-7,9H,8,10-11H2
charge 0 multiplicity 1
30 atoms
N  0.326788 -0.398982 0.302991
N  -3.144472 0.281891 1.390909
C  0.393229 -1.875074 0.102986
C  1.706072 -2.09062 -0.707468
C  1.621791 0.144353 0.162239
C  2.500593 -0.821291 -0.412785
C  -0.705104 0.147241 1.178541
C  2.083671 1.442644 0.478359
C  3.840588 -0.50106 -0.667083
C  -2.084105 0.242009 0.525066
C  3.44283 1.752346 0.218575
C  4.321425 0.798209 -0.344183
C  -2.244966 0.320589 -0.879752
C  -3.547055 0.445835 -1.412125
C  -4.395982 0.407348 0.861733
C  -4.649004 0.490569 -0.526755
H  -0.504884 -2.243344 -0.423612
H  0.444847 -2.386634 1.091131
H  1.486774 -2.163896 -1.790845
H  2.228554 -3.016279 -0.411236
H  -0.406826 1.161287 1.503931
H  -0.817071 -0.453502 2.107469
H  1.422169 2.2003 0.911983
H  4.514968 -1.244515 -1.108748
H  3.815932 2.75375 0.463495
H  5.368439 1.05916 -0.530898
H  -1.357409 0.283891 -1.518995
H  -3.699891 0.509717 -2.495072
H  -5.219172 0.437791 1.585334
H  -5.674823 0.585766 -0.896585
