program: Gaussian 09
title: 000210118
version: EM64L-G09RevD.01
frameworkgroup: C1[X(C19H23N3O2)]
method: RPBEPBE
basis: SDD
operation: Freq
keyword: #p
keyword: freq=noraman
keyword: PBEPBE/SDD
title: #p freq=noraman PBEPBE/SDD
converged: YES YES NO NO
title: Mulliken charges:
elementType: O O N N N C C C C C C C C C C C C C C C C C C C H H H H H H H H H H H H H H H H H H H H H H H
charge: -0.314085 -0.266877 -0.189622 -0.160016 -0.507289 -0.157369 -0.537162 -0.422114 -0.350873 0.269006 0.418618 -0.681612 -0.346878 -0.374013 0.484358 -0.245194 -0.229955 -0.267915 -0.465685 -0.320075 -0.330037 -0.353565 0.319836 -0.538294 0.249096 0.249057 0.242004 0.250231 0.230887 0.260879 0.230255 0.238053 0.229362 0.247939 0.321657 0.227313 0.239064 0.218475 0.220120 0.226980 0.211501 0.310917 0.237914 0.247492 0.216899 0.217436 0.243281
chargesum: 0.00000
title: Mulliken charges with hydrogens summed into heavy atoms:
elementType: O O N N N C C C C C C C C C C C C C C C C C C C
charge: -0.314085 -0.266877 -0.189622 -0.160016 -0.185631 0.091727 -0.046101 0.059004 0.140261 0.269006 0.418618 0.033742 -0.119565 -0.134949 0.484358 -0.026719 -0.009835 -0.040935 -0.254184 -0.009158 -0.092123 -0.106073 0.319836 0.139322
polarizability: 3.10320239e+02 2.25835460e+00 2.58428370e+02 1.47040001e+00 -1.89890222e+01 1.62960395e+02
1716.lowfreq: -10.3687 -5.4918 0.0002 0.0007 0.0008 5.5197 10.0392 20.1578 26.2075
frequency: 9.3188 19.9352 26.1311 37.9850 58.9328 69.2270 79.7591 98.1875 112.1805 139.5765 147.2044 165.1775 180.9335 194.1678 206.5626 232.9596 248.4906 255.7480 301.7278 319.8506 347.4930 350.2900 368.0392 376.7945 413.6351 416.5556 436.1359 473.8969 509.0276 515.9999 529.2379 539.1504 543.7065 551.2785 614.2780 630.3108 683.8840 691.8837 699.6316 713.9572 718.9965 743.9780 753.0719 772.9262 795.8335 809.0982 820.6449 840.2448 847.7344 849.6702 864.9138 870.7039 910.3718 937.3879 954.7274 969.7812 975.5850 977.3575 984.8050 989.0868 999.0700 1007.5979 1030.0674 1056.8194 1059.5778 1094.0545 1104.0217 1111.0809 1112.4583 1117.2438 1121.7545 1156.8369 1170.1988 1173.9249 1178.9631 1182.1437 1188.1054 1199.7470 1207.1429 1217.8085 1255.1391 1268.7128 1283.3466 1295.5287 1311.6251 1323.2694 1327.6893 1334.0025 1342.0889 1350.4200 1374.0709 1379.1312 1395.4511 1422.8308 1436.9238 1445.0353 1450.7143 1465.1337 1466.7759 1473.7173 1479.2516 1489.8755 1496.6132 1500.8318 1502.3838 1510.5320 1516.7855 1576.5869 1590.6429 1613.2116 1620.3951 1632.9584 2920.9146 2947.9294 2951.6876 2983.6291 3006.4528 3008.0670 3013.8240 3029.4947 3035.9659 3048.9694 3092.0439 3107.9061 3120.6915 3122.0734 3128.9428 3132.7164 3154.0630 3159.8582 3161.7776 3162.4176 3172.6920 3194.4115 3539.7686
redmass: 4.4180 4.3928 3.5184 4.3007 3.6320 5.5845 4.5225 3.6057 3.5995 4.3114 2.8012 2.5566 2.8986 3.0874 3.1428 2.6306 1.2112 2.4945 3.2802 3.5618 3.0506 4.4070 4.5120 3.7258 3.0608 2.9327 4.4791 3.7344 3.2441 2.0104 3.6447 3.5306 4.6173 1.4431 6.3615 7.0221 3.3224 1.7805 10.6008 4.8095 3.6330 3.6745 2.0384 4.4618 1.4000 1.2960 2.6660 3.0052 4.1614 1.4808 1.6768 2.8039 1.3849 1.9131 1.3807 2.9224 1.4932 3.1331 1.3051 7.7037 2.8137 1.9071 2.2451 2.1004 2.8863 1.5912 1.8779 1.3474 1.2610 1.3269 1.8168 1.3329 1.2243 1.1065 1.2333 1.2197 3.3092 1.5139 1.1625 2.3778 1.7293 2.2581 1.6364 1.5960 1.3470 2.2878 1.9921 2.0422 1.4789 1.5511 2.7508 6.7462 1.9549 4.2875 1.1707 1.4277 1.7948 1.0787 1.0503 1.0768 1.0972 1.0847 1.8643 1.8689 1.4167 1.4360 1.5687 5.9299 7.7765 4.0621 5.8860 6.3468 1.0651 1.0408 1.0334 1.0662 1.0946 1.1005 1.0803 1.0763 1.1036 1.0938 1.1017 1.0894 1.0987 1.0847 1.0890 1.0914 1.0919 1.0909 1.0928 1.0945 1.0981 1.0951 1.0755
irintensity: 0.4280 0.5447 3.2480 1.4150 0.2026 3.8208 0.9586 7.6439 4.8489 1.6183 0.5680 1.8020 1.7011 1.2617 3.1741 5.3401 0.1027 0.9353 7.6200 8.0365 0.6180 1.6972 5.4602 1.5539 0.0253 0.0529 0.8093 4.0311 14.0718 58.0567 3.6171 2.7790 33.7213 19.7492 0.2780 1.7786 2.5535 44.0831 20.0618 3.8158 0.0064 0.9559 90.8843 0.4437 40.0126 0.5408 1.8530 3.0968 6.3135 62.8205 8.3341 4.2140 0.7519 4.9604 0.4894 7.9991 1.6429 24.0317 2.2076 42.9348 13.3935 25.6555 18.7307 4.4346 4.5402 6.3631 20.6910 14.5460 0.2722 20.1540 29.9035 1.0670 6.9180 1.5973 96.9201 6.3204 21.5011 23.5975 17.5157 271.4069 10.3244 12.0408 115.4315 23.2882 0.5238 67.9139 182.4074 38.0167 24.1538 38.1346 28.8151 406.5365 37.0576 27.6878 17.7357 11.2899 7.7042 47.5547 12.7243 134.3949 38.3237 25.3252 76.9767 58.1110 81.7582 350.1843 362.1353 11.0944 45.7853 374.3144 86.5499 12.1065 43.5337 78.3558 80.2776 42.3865 18.9637 36.0932 9.2108 38.5142 55.2688 41.9053 28.9938 29.7173 25.8725 8.8292 11.9006 13.0448 45.8878 8.7488 9.9413 31.4266 4.2840 9.3358 7.9440
temp: 298.150 k
press: 1.00000 atm
elementType: 8 8 7 7 7 6 6 6 6 6 6 6 6 6 6 6 6 6 6 6 6 6 6 6 1 1 1 1 1 1 1 1 1 1 1 1 1 1 1 1 1 1 1 1 1 1 1
symmnumber: 1
zpe: 1018696.5 jmol-1
zpe.correction: 0.388001 hartree
zpe.thermalcorrener: 0.410607 hartree
zpe.thermalcorrenthalpy: 0.411551 hartree
zpe.thermalcorrgfe: 0.332750 hartree
zpe.sumelectzpe: -1050.749910 hartree
zpe.sumelectthermal: -1050.727304 hartree
zpe.sumelectthermalent: -1050.726360 hartree
zpe.sumelectthermalfe: -1050.805161 hartree
dipole: 2.9350 2.2838 -1.9176
dipole: 4.1842
quadrupole: -145.0722 -136.0080 -138.4208
quadrupole: -25.8905 6.9123 -1.4956
quadrupole: -5.2386 3.8257 1.4129 -25.8905 6.9123 -1.4956
hfenergy: -1051.1379106 hartree
pointgroup: C01 [X(C19H23N3O2)]
dipole: -1.1554265 -0.9107851 -0.7384718 debye
polarizability: 310.366275|0.9097191|259.9211709|2.1037499|14.52563|161.4215571 unknown
InChI: InChI=1S/C19H23N3O2/c1-21(16-6-4-3-5-7-16)17-12-13-22(14-17)19(23)20-15-8-10-18(24-2)11-9-15/h3-11,17,20H,12-14H2,1-2H3
charge 0 multiplicity 1
47 atoms
O  1.470312 2.760091 0.388447
O  6.832193 -1.085737 0.71053
N  -0.494952 1.779147 -0.371333
N  -3.563531 0.741106 0.264612
N  1.461525 0.476256 -0.236984
C  -2.78281 1.233436 -0.88856
C  -2.577686 2.773998 -0.950694
C  -1.314902 0.685762 -0.92807
C  -1.217231 3.069349 -0.273779
C  0.85944 1.730703 -0.044523
C  -4.136641 -0.545359 0.203695
C  -3.643144 1.489098 1.527012
C  -3.924224 -1.420484 -0.911529
C  -4.960253 -1.02809 1.270083
C  2.816826 0.112866 0.012888
C  -4.530296 -2.692606 -0.959374
C  -5.552949 -2.304869 1.208352
C  -5.351563 -3.152283 0.094678
C  3.192842 -1.229633 -0.245158
C  3.798651 1.021316 0.499913
C  4.514976 -1.674494 -0.028552
C  5.114866 0.578016 0.7159
C  5.484987 -0.764095 0.455737
C  7.249395 -2.463288 0.453174
H  -3.318285 0.907426 -1.798092
H  -3.414788 3.331726 -0.500221
H  -2.527857 3.064298 -2.015034
H  -1.250854 -0.238191 -0.321136
H  -1.0167 0.444262 -1.972893
H  -0.648495 3.867403 -0.782871
H  -1.313264 3.377308 0.785495
H  -3.248791 0.893518 2.374683
H  -4.686135 1.77796 1.769385
H  -3.047587 2.409511 1.466175
H  0.873156 -0.27944 -0.591029
H  -3.279804 -1.124265 -1.744202
H  -5.150842 -0.402175 2.145787
H  -4.347695 -3.333328 -1.830269
H  -6.182184 -2.637585 2.042314
H  -5.815463 -4.142874 0.052767
H  2.446838 -1.943515 -0.619415
H  3.512409 2.055057 0.700493
H  4.766864 -2.718124 -0.238857
H  5.878317 1.266888 1.090601
H  7.116516 -2.734641 -0.613153
H  6.692323 -3.180932 1.087944
H  8.318296 -2.494898 0.711463
