program: Gaussian 09
title: 000210095
version: EM64L-G09RevD.01
frameworkgroup: C1[X(C14H21N)]
method: RPBEPBE
basis: SDD
operation: Freq
keyword: #pfreq=noraman
keyword: PBEPBE/SDD
title: #p freq=noraman PBEPBE/SDD
converged: YES YES NO NO
title: Mulliken charges:
elementType: N C C C C C C C C C C C C C C H H H H H H H H H H H H H H H H H H H H H
charge: -0.123988 0.420466 -0.543104 -0.535493 -0.418093 -0.402379 -0.645831 0.494469 -0.643294 -0.644891 -0.406630 -0.401021 -0.243059 -0.243131 -0.243644 0.234882 0.215931 0.205802 0.236972 0.195850 0.224600 0.224991 0.195696 0.216979 0.210523 0.215839 0.235178 0.190480 0.218663 0.194707 0.227249 0.232231 0.230794 0.222834 0.222792 0.226628
chargesum: 0.00000
title: Mulliken charges with hydrogens summed into heavy atoms:
elementType: N C C C C C C C C C C C C C C
charge: -0.123988 0.420466 -0.092290 -0.092718 0.002357 0.018308 -0.218329 0.494469 -0.001797 -0.004272 -0.174398 -0.170226 -0.020225 -0.020339 -0.017016
polarizability: 1.96713264e+02 1.52168939e+01 1.20533055e+02 4.74353936e-02 -2.22717575e-02 1.45956554e+02
1716.lowfreq: -16.3566 -5.4869 -3.3110 -0.0006 0.0005 0.0006 26.0615 59.1025 66.4236
frequency: 23.0199 58.9220 66.2706 71.9610 106.0052 133.8117 178.0241 197.3966 214.4041 234.5933 238.8238 333.3841 344.2749 376.1788 404.9594 420.1809 443.9082 454.0147 462.0577 585.3036 608.2505 617.6450 637.2617 664.2929 706.7548 764.7281 775.3322 799.9484 820.2050 853.3757 855.4201 873.0424 889.1775 916.3831 958.0638 970.1523 973.8410 989.5190 991.0865 997.1279 1025.4423 1026.6564 1042.2578 1044.8935 1060.9940 1086.2159 1087.2707 1106.6742 1134.4079 1170.1760 1173.4748 1183.4979 1187.7827 1192.7091 1202.0795 1218.3591 1224.9067 1255.1108 1267.3151 1284.0796 1289.4594 1306.4681 1318.2518 1326.3383 1329.1357 1382.0358 1418.6005 1439.3132 1441.8974 1458.5556 1462.4360 1465.4467 1469.9265 1475.7431 1480.5320 1483.1186 1486.9599 1494.4415 1504.2905 1588.4965 1611.4685 2853.8168 2867.9436 2975.3154 2998.2239 3005.9795 3009.5414 3013.5103 3018.8862 3021.5688 3030.3490 3047.6982 3062.2526 3068.3764 3085.9715 3088.5521 3092.4251 3113.6398 3113.8853 3130.5993 3141.0567 3160.5333
redmass: 3.2930 2.2907 3.2654 4.0601 1.7939 2.8451 3.3323 1.1768 1.7622 1.4573 3.8587 2.1822 2.0770 3.5221 2.8473 2.1610 2.6796 2.2593 3.6354 4.2809 3.4171 6.1223 2.7629 2.3507 1.7221 1.9754 1.4720 1.7448 3.3551 1.2907 3.0515 1.8170 2.5128 1.4560 1.9153 1.9037 1.3906 5.8500 1.3347 1.7969 1.6820 2.1484 1.4618 3.8030 1.6974 1.3570 1.8323 1.7548 1.4166 1.1191 1.3266 1.6199 1.1265 1.9397 1.5891 2.6339 1.2902 2.1008 1.7204 1.3104 1.3774 1.4767 1.3100 1.6310 1.2842 7.0101 1.1420 2.1349 1.1507 1.0710 1.0844 1.0784 1.0666 1.1011 1.6392 1.2896 1.0787 1.0614 1.0796 5.9202 6.1285 1.0577 1.0584 1.0585 1.0586 1.0601 1.0612 1.0751 1.0728 1.0664 1.1013 1.1014 1.1014 1.1031 1.1040 1.0953 1.0958 1.0854 1.0877 1.0909 1.0958 1.1014
irintensity: 0.0063 0.2133 0.0188 0.1221 0.0582 0.8357 0.0161 0.9032 0.1590 0.1961 2.1378 0.4930 0.6026 18.7999 0.0013 0.2850 0.3582 2.7161 5.4365 7.9653 4.8266 0.1133 1.2633 9.8204 54.7041 30.6055 7.8146 1.1202 10.8660 0.3026 5.5655 0.6623 5.1748 1.1050 16.7879 4.4118 0.0194 0.9896 2.6797 62.6588 0.5955 9.7253 10.3468 6.7462 3.8554 13.0301 15.5786 0.4633 11.6494 0.0103 0.1434 13.0221 0.7016 11.7420 4.1755 2.5923 5.0971 3.1068 1.8132 8.4691 4.7606 1.2642 46.5909 11.4694 0.7592 0.4818 2.8957 5.4119 11.1349 8.4982 5.6448 5.5409 2.3091 17.9776 35.1264 2.0045 11.1149 13.9350 7.0777 1.4225 21.5744 63.5350 167.1828 33.6760 10.6335 75.1922 46.3561 58.0231 50.4509 37.3530 13.2711 14.3608 2.0137 15.8883 110.7683 43.1812 12.4678 12.2561 4.1371 10.3842 46.6869 26.0294
temp: 298.150 k
press: 1.00000 atm
elementType: 7 6 6 6 6 6 6 6 6 6 6 6 6 6 6 1 1 1 1 1 1 1 1 1 1 1 1 1 1 1 1 1 1 1 1 1
symmnumber: 1
zpe: 832101.1 jmol-1
zpe.correction: 0.316931 hartree
zpe.thermalcorrener: 0.331913 hartree
zpe.thermalcorrenthalpy: 0.332858 hartree
zpe.thermalcorrgfe: 0.274258 hartree
zpe.sumelectzpe: -599.661002 hartree
zpe.sumelectthermal: -599.646019 hartree
zpe.sumelectthermalent: -599.645075 hartree
zpe.sumelectthermalfe: -599.703674 hartree
dipole: -0.2246 -0.6046 0.0627
dipole: 0.6481
quadrupole: -90.6313 -94.8985 -86.6103
quadrupole: 5.6538 -0.3126 0.1743
quadrupole: 0.0820 -4.1851 4.1030 5.6538 -0.3126 0.1743
hfenergy: -599.9779321 hartree
pointgroup: C01 [X(C14H21N1)]
dipole: -0.0876687 -0.2366301 0.0364736 debye
polarizability: 196.594975|15.5017245|120.72687|-0.3957717|1.413968|145.8810286 unknown
InChI: InChI=1S/C14H21N/c1-15(2)14(10-6-7-11-14)12-13-8-4-3-5-9-13/h3-5,8-9H,6-7,10-12H2,1-2H3
charge 0 multiplicity 1
36 atoms
N  -2.54834 -0.7122 0.008671
C  -1.184806 -0.069795 -0.025009
C  -1.076687 1.006451 1.094566
C  -1.085199 0.854719 -1.275864
C  -2.003209 2.159093 0.626039
C  -1.968102 2.091032 -0.938996
C  -0.049754 -1.168841 0.049588
C  1.386464 -0.674747 0.049415
C  -2.983844 -1.282134 1.298396
C  -2.854936 -1.643421 -1.096037
C  2.099804 -0.499945 -1.167344
C  2.06357 -0.384673 1.264739
C  3.434966 -0.038429 -1.173035
C  3.39899 0.076217 1.265994
C  4.090934 0.254962 0.045297
H  -0.027438 1.352857 1.122311
H  -1.31519 0.63369 2.105731
H  -1.383509 0.364062 -2.218572
H  -0.029217 1.160166 -1.392619
H  -1.663204 3.136412 1.014737
H  -3.033423 1.995319 0.987734
H  -2.988833 1.956396 -1.335742
H  -1.553241 3.012274 -1.387545
H  -0.194704 -1.853129 -0.808845
H  -0.23065 -1.762381 0.967634
H  -4.035615 -1.609771 1.201695
H  -2.949504 -0.525646 2.098463
H  -2.391143 -2.170639 1.633812
H  -3.94305 -1.842146 -1.106911
H  -2.338373 -2.632552 -1.016299
H  -2.589656 -1.20068 -2.069293
H  1.604155 -0.738304 -2.116982
H  1.539028 -0.530767 2.21751
H  3.964971 0.085416 -2.124546
H  3.901193 0.289815 2.216672
H  5.127847 0.609417 0.043936
