program: Gaussian 09
title: 000210098
version: EM64L-G09RevD.01
frameworkgroup: C1[X(C18H18N2O3)]
method: RPBEPBE
basis: SDD
operation: Freq
keyword: #p
keyword: freq=noraman
keyword: PBEPBE/SDD
title: #p freq=noraman PBEPBE/SDD
converged: YES YES NO NO
title: Mulliken charges:
elementType: O O O N N C C C C C C C C C C C C C C C C C C H H H H H H H H H H H H H H H H H H
charge: -0.286300 -0.254718 -0.257666 -0.200627 -0.363504 0.302024 0.021381 0.439582 0.129030 -0.301570 -0.332361 -0.350619 -0.408948 -0.380825 0.230026 -0.347446 -0.293328 -0.335836 -0.342784 -0.212775 -0.240985 0.176369 -0.688129 0.335884 0.249407 0.202515 0.227472 0.266396 0.263172 0.250223 0.204117 0.192425 0.229779 0.218940 0.275149 0.273930 0.230069 0.235127 0.215861 0.210671 0.218874
chargesum: 0.00000
title: Mulliken charges with hydrogens summed into heavy atoms:
elementType: O O O N N C C C C C C C C C C C C C C C C C C
charge: -0.286300 -0.254718 -0.257666 -0.200627 -0.027621 0.302024 0.021381 0.439582 0.129030 -0.052163 -0.065965 0.079368 -0.145776 -0.130602 0.230026 0.049097 0.155390 -0.060687 -0.068854 0.017294 -0.005858 0.176369 -0.042724
polarizability: 4.32941827e+02 1.02800742e+01 2.21445515e+02 2.35470060e+01 8.30717597e-01 1.19441647e+02
1716.lowfreq: -3.0389 -0.0010 0.0004 0.0007 2.8388 4.3975 18.7211 20.4895 40.5155
frequency: 18.7011 20.4667 40.5126 48.8436 58.1564 68.4192 87.5313 105.1182 123.7943 143.5214 154.8290 184.1956 200.3012 212.5436 233.3194 266.3364 275.7526 303.9955 305.4790 335.9239 382.0900 407.6741 414.7455 418.4755 450.6456 470.3760 498.5011 505.9001 533.8263 544.0529 585.7240 616.1282 633.2959 659.1882 674.2897 680.9256 742.3186 745.2597 751.1888 754.0047 755.2661 770.7577 781.5161 811.0137 838.7402 856.0260 867.2509 896.0294 911.5554 924.8057 941.9848 957.3252 978.5164 989.1119 992.1329 1000.9816 1018.5371 1029.7425 1059.8034 1073.6024 1076.2752 1093.6036 1114.4056 1115.7635 1137.4811 1164.4198 1173.9762 1184.9402 1199.8695 1227.0804 1243.6545 1255.5649 1271.7653 1289.4191 1289.9753 1297.0873 1310.4169 1314.3167 1344.3354 1370.8285 1371.1243 1392.0830 1407.7160 1415.3869 1430.0238 1452.0829 1460.8702 1468.8730 1471.3115 1477.3067 1478.4191 1488.8938 1508.2149 1564.4245 1592.6832 1612.8640 1617.6660 1628.8926 1655.3649 2969.4056 2976.8274 2992.3510 3015.0466 3022.2189 3052.1109 3074.7715 3076.9514 3100.4771 3138.5653 3147.8802 3153.1614 3163.6736 3167.3549 3171.3016 3181.5174 3186.6032 3562.4727
redmass: 4.1646 5.1914 5.8006 3.7263 4.1684 2.0854 4.5681 2.5772 4.5503 5.3203 5.5880 5.2751 4.5652 4.5714 1.1485 4.8108 7.6260 5.2887 4.9947 5.1909 4.5957 3.0472 2.9918 2.6999 1.5408 6.4718 3.2510 6.0147 3.9918 6.6527 5.6265 5.2489 6.8982 5.1878 5.3410 5.0190 2.2628 1.4933 2.4333 4.0676 2.8697 2.1876 4.4653 1.4152 1.2983 1.5834 1.4071 2.3259 3.7280 6.4228 1.2002 1.3789 1.3470 1.3230 1.3539 3.2421 2.1954 3.6190 4.7504 3.7367 2.4436 2.8391 1.7931 2.4814 1.8146 1.7361 1.1420 1.1959 2.0502 1.3204 3.3300 3.5971 1.3068 1.1421 1.0765 1.4403 1.7046 1.5187 1.4605 4.0776 1.4374 1.2141 4.0189 3.6149 3.7715 1.1038 2.8405 2.9809 1.0684 1.0571 1.0476 1.0872 3.2354 7.6778 7.4722 7.4094 8.4654 7.3770 9.1549 1.0587 1.0366 1.0598 1.0998 1.0573 1.1032 1.1012 1.0995 1.1087 1.0867 1.0882 1.0905 1.0890 1.0967 1.0969 1.0973 1.0962 1.0810
irintensity: 0.0815 0.1688 1.9293 0.9579 0.2873 0.8962 2.9908 0.2766 0.7814 1.7683 0.9468 0.7826 2.4910 7.4067 0.4147 7.0174 3.6015 10.4527 12.8612 24.2503 12.9744 8.9399 11.9605 20.2630 90.1346 6.3434 6.0905 7.6279 3.9384 2.7074 6.9439 1.8098 1.6296 22.5396 11.5748 19.3734 3.7099 13.2027 79.1884 4.9807 5.0855 23.2208 12.8245 1.8477 3.4006 45.7158 6.6618 22.9821 12.0729 5.4961 0.3552 1.0795 2.6803 0.0902 8.3053 44.1322 9.1084 5.0346 450.8661 34.4759 5.7108 0.2336 43.6875 8.7237 16.3789 54.8700 25.2476 128.0281 37.6239 12.4718 57.0040 439.1038 36.4651 5.1471 1.6688 16.3034 110.6550 71.4367 9.4765 12.6191 3.1784 10.3678 80.7514 12.8322 21.3793 44.2681 232.9749 95.4148 0.3384 6.7131 9.5852 22.4130 319.3975 4.9406 1.8357 727.4262 63.1772 42.9048 503.8684 33.1548 33.8982 22.1484 8.0322 59.0753 7.0188 61.2067 56.2749 31.8236 3.7032 2.0634 6.0421 7.7833 3.7358 18.9637 3.9452 6.5669 46.2784
temp: 298.150 k
press: 1.00000 atm
elementType: 8 8 8 7 7 6 6 6 6 6 6 6 6 6 6 6 6 6 6 6 6 6 6 1 1 1 1 1 1 1 1 1 1 1 1 1 1 1 1 1 1
symmnumber: 1
zpe: 850743.0 jmol-1
zpe.correction: 0.324031 hartree
zpe.thermalcorrener: 0.345009 hartree
zpe.thermalcorrenthalpy: 0.345953 hartree
zpe.thermalcorrgfe: 0.271546 hartree
zpe.sumelectzpe: -1030.248409 hartree
zpe.sumelectthermal: -1030.227431 hartree
zpe.sumelectthermalent: -1030.226487 hartree
zpe.sumelectthermalfe: -1030.300894 hartree
dipole: -2.8934 4.4188 0.4924
dipole: 5.3047
quadrupole: -140.8760 -131.7519 -139.6774
quadrupole: 12.8655 -7.6787 -0.5314
quadrupole: -3.4409 5.6832 -2.2423 12.8655 -7.6787 -0.5314
hfenergy: -1030.5724399 hartree
pointgroup: C01 [X(C18H18N2O3)]
dipole: 1.1052744 -1.6224766 -0.7082899 debye
polarizability: 434.0028687|14.7666109|194.9577113|-11.7553519|44.7122721|144.8684098 unknown
InChI: InChI=1S/C18H18N2O3/c1-2-3-12-23-18(22)13-8-10-14(11-9-13)20-16-7-5-4-6-15(16)17(21)19-20/h4-11,19H,2-3,12H2,1H3
charge 0 multiplicity 1
41 atoms
O  3.92703 -0.638861 -0.744826
O  -5.204328 1.690269 1.936175
O  3.982728 1.653804 -0.286443
N  -2.328813 0.207875 0.447945
N  -2.990594 1.208837 1.217247
C  -3.335499 -0.567419 -0.162018
C  -4.605928 -0.109842 0.300246
C  -0.939676 0.290473 0.210065
C  -4.39998 1.013223 1.236744
C  -3.2423 -1.600456 -1.126068
C  -5.801148 -0.707303 -0.146631
C  6.135532 -0.88795 0.389549
C  -0.270154 1.544297 0.30722
C  -0.190603 -0.885705 -0.079936
C  1.866887 0.447665 -0.198348
C  7.668135 -0.966744 0.191405
C  5.407892 -0.625653 -0.935969
C  1.11768 1.61359 0.107389
C  1.195119 -0.800091 -0.289647
C  -4.448297 -2.183061 -1.568378
C  -5.717443 -1.757965 -1.082213
C  3.334296 0.58165 -0.399307
C  8.414754 -1.254145 1.512062
H  -2.46834 1.670776 1.964181
H  -2.286754 -1.932039 -1.537904
H  5.766961 -1.835899 0.82769
H  5.89439 -0.077493 1.103091
H  -6.761905 -0.341112 0.229098
H  -0.842449 2.458458 0.493218
H  -0.681747 -1.86204 -0.087219
H  8.033504 -0.013183 -0.240129
H  7.906147 -1.758955 -0.547667
H  5.70107 0.350247 -1.363124
H  5.587256 -1.432455 -1.666395
H  1.644144 2.571584 0.168801
H  1.775961 -1.700982 -0.504162
H  -4.402287 -2.986175 -2.312335
H  -6.626938 -2.243468 -1.449671
H  8.219667 -0.46092 2.257565
H  8.088134 -2.215589 1.950726
H  9.507097 -1.307941 1.352969
