program: Gaussian 09
title: 000210084
version: EM64L-G09RevD.01
frameworkgroup: C1[X(C17H21NO2)]
method: RPBEPBE
basis: SDD
operation: Freq
keyword: #p
keyword: freq=noraman
keyword: PBEPBE/SDD
title: #p freq=noraman PBEPBE/SDD
converged: YES YES NO NO
title: Mulliken charges:
elementType: O O N C C C C C C C C C C C C C C C C C H H H H H H H H H H H H H H H H H H H H H
charge: -0.338037 -0.261181 -0.408646 -0.066342 -0.426717 -0.406438 -0.412941 -0.407801 -0.378341 0.302409 0.050211 0.450470 -0.724187 -0.388673 -0.383155 0.282394 -0.224647 -0.241362 -0.241385 -0.538945 0.254532 0.218397 0.198588 0.194456 0.230410 0.182665 0.209663 0.205493 0.198736 0.194749 0.202398 0.317766 0.233914 0.232944 0.237954 0.247207 0.245949 0.224268 0.223131 0.226685 0.283408
chargesum: 0.00000
title: Mulliken charges with hydrogens summed into heavy atoms:
elementType: O O N C C C C C C C C C C C C C C C C C
charge: -0.338037 -0.261181 -0.090880 0.188189 -0.009732 0.018428 -0.020613 -0.003572 0.018806 0.302409 0.050211 0.450470 -0.019375 -0.141466 -0.137206 0.282394 -0.000378 -0.018231 -0.014700 -0.255537
polarizability: 2.05578613e+02 2.38648563e+00 2.00414067e+02 -2.24354195e+01 1.00026851e+01 1.58157893e+02
1716.lowfreq: -4.4485 -0.0009 -0.0007 0.0001 5.3449 7.1188 25.6923 36.6686 45.8264
frequency: 25.3112 36.3386 43.6187 55.5788 66.8757 81.2022 98.1284 122.3601 148.4828 180.1547 209.2410 222.0713 231.3180 232.3150 251.4273 283.8726 311.3881 343.1390 375.3980 390.2645 403.2577 420.1464 445.4366 460.2093 473.7132 497.5555 547.5897 570.1927 605.3547 616.5886 621.3082 628.6825 672.5797 690.5802 698.2733 703.0431 709.8500 771.4036 771.7713 791.0739 824.6932 834.7700 852.7470 863.4590 878.4129 902.1593 919.7040 925.9228 935.5239 978.6218 990.7812 995.3292 1007.8391 1018.0656 1024.3919 1044.4666 1053.3989 1061.5224 1078.0992 1080.9055 1089.4514 1111.8783 1150.7025 1156.8194 1160.6734 1172.2355 1184.3043 1191.9863 1236.9049 1242.2347 1257.7635 1272.1700 1302.4991 1320.3754 1323.6590 1330.1480 1334.2463 1350.4075 1354.3312 1364.8612 1382.4612 1386.5340 1436.7388 1451.3893 1457.3765 1458.5162 1460.0829 1465.2778 1465.4430 1471.3461 1482.1337 1483.1080 1594.9727 1613.4385 1674.4824 2139.9318 2954.8664 2966.4061 2968.1971 2976.8141 2983.4056 3004.2095 3027.0843 3029.6884 3034.6553 3038.8514 3045.6541 3051.4799 3111.8780 3114.7528 3121.9545 3130.6314 3143.0842 3153.9163 3165.7166 3428.8776 3571.6068
redmass: 5.3109 3.6289 3.4511 4.5011 4.2702 4.8772 5.3922 4.1842 4.2353 3.2900 2.4418 2.7337 2.8399 3.0300 1.5409 3.1821 3.0081 2.8730 2.4689 3.0479 2.8384 3.9790 5.5625 2.3982 2.0315 3.8234 1.2571 4.2080 3.9082 6.2410 3.1400 1.2582 1.2599 5.7408 6.5853 2.2933 4.0821 1.5679 1.8487 3.5429 2.6723 1.8107 1.2673 2.4561 2.5400 2.2109 1.5419 1.4456 2.7141 1.3865 4.8413 1.4012 2.9915 2.7500 2.5006 1.5471 1.9405 2.0883 1.7899 1.6799 1.7266 1.0447 2.1811 1.9712 3.2016 1.0586 1.9037 1.1795 3.5622 1.3408 1.2710 1.3096 1.6718 1.3237 1.4896 1.3644 1.4378 1.4421 1.4596 1.3790 5.5079 1.2943 2.2251 1.0989 1.1712 1.0840 1.4160 1.0894 1.0512 1.0969 1.7266 1.3360 6.3045 6.0669 10.5170 6.0352 1.0669 1.0643 1.0616 1.0627 1.0622 1.0340 1.0927 1.0961 1.0917 1.0962 1.1014 1.1019 1.1007 1.1015 1.0845 1.0878 1.0929 1.0956 1.1007 1.1596 1.0765
irintensity: 1.0240 0.1821 0.2144 3.1972 1.1854 2.8556 1.7287 0.9342 0.2761 0.6214 0.6823 0.7038 4.1660 6.0928 0.2507 3.1690 4.0769 1.7150 0.3006 0.7799 0.1068 5.4944 5.2576 5.7683 1.3857 1.4882 85.8722 11.7216 10.6241 0.4707 0.2254 70.5557 54.6322 1.2473 31.0797 34.9919 39.4465 3.5092 37.4089 2.0475 16.5663 17.1598 0.1590 11.1086 23.4828 8.7181 63.0738 5.4705 173.9516 0.0745 0.4908 3.1300 92.1232 90.3036 14.1608 23.5749 48.0298 3.7789 12.9969 13.0765 0.1656 1.3254 0.8802 9.2956 24.2791 1.0122 128.4163 18.4608 69.9974 17.5882 3.7171 8.4157 14.8652 2.8581 32.7220 8.2985 0.2993 7.3622 1.4297 11.4356 2.3159 15.3812 17.6462 29.8397 72.6393 0.5309 247.6623 7.6312 18.0262 53.4033 24.8595 60.5250 1.2980 2.7089 285.0347 0.7764 30.8466 32.4087 34.1111 18.3091 30.1112 13.0744 74.9074 70.6729 6.1518 49.9120 21.5506 94.0147 17.5715 25.0800 0.8940 3.3531 26.2717 26.1501 19.0111 62.7826 32.1164
temp: 298.150 k
press: 1.00000 atm
elementType: 8 8 7 6 6 6 6 6 6 6 6 6 6 6 6 6 6 6 6 6 1 1 1 1 1 1 1 1 1 1 1 1 1 1 1 1 1 1 1 1 1
symmnumber: 1
zpe: 893805.0 jmol-1
zpe.correction: 0.340432 hartree
zpe.thermalcorrener: 0.360036 hartree
zpe.thermalcorrenthalpy: 0.360980 hartree
zpe.thermalcorrgfe: 0.291410 hartree
zpe.sumelectzpe: -864.072695 hartree
zpe.sumelectthermal: -864.053091 hartree
zpe.sumelectthermalent: -864.052147 hartree
zpe.sumelectthermalfe: -864.121717 hartree
dipole: -1.9146 0.1653 1.7937
dipole: 2.6288
quadrupole: -104.8724 -110.6807 -118.2752
quadrupole: -0.2725 -2.0283 1.9659
quadrupole: 6.4037 0.5954 -6.9991 -0.2725 -2.0283 1.9659
hfenergy: -864.413127 hartree
pointgroup: C01 [X(C17H21N1O2)]
dipole: -0.7569108 -0.0638853 -0.701896 debye
polarizability: 205.733874|-2.2137109|200.6072869|22.3307467|9.48238|157.8094119 unknown
InChI: InChI=1S/C17H21NO2/c1-3-17(2,14-10-6-4-7-11-14)20-16(19)18-15-12-8-5-9-13-15/h1,4,6-7,10-11,15,18H,5,8-9,12-13H2,2H3
charge 0 multiplicity 1
41 atoms
O  0.272425 0.96615 -0.870695
O  0.013207 0.447898 1.437513
N  -1.80404 0.56972 -0.048191
C  -2.851088 0.208852 0.932778
C  -4.140635 1.025129 0.665276
C  -3.151636 -1.316209 0.91457
C  -4.866647 0.584317 -0.631298
C  -3.862383 -1.754482 -0.387839
C  -5.155649 -0.936892 -0.625083
C  -0.475244 0.635753 0.297651
C  1.767776 1.130078 -0.712897
C  2.406843 -0.204893 -0.2860
C  2.205562 1.51484 -2.149609
C  3.389974 -0.273993 0.726764
C  2.038388 -1.387426 -0.975913
C  2.054939 2.252908 0.203627
C  4.0041 -1.506973 1.042068
C  2.645416 -2.619864 -0.655833
C  3.63604 -2.683804 0.352229
C  2.32394 3.243437 0.883086
H  -2.438723 0.477279 1.922323
H  -3.898132 2.104248 0.633132
H  -4.82311 0.869513 1.524306
H  -3.801387 -1.548606 1.78316
H  -2.206873 -1.872605 1.057383
H  -4.25219 0.836523 -1.522062
H  -5.808498 1.15499 -0.741357
H  -4.095906 -2.835379 -0.343469
H  -3.174533 -1.616487 -1.247719
H  -5.880893 -1.162996 0.184032
H  -5.633092 -1.239403 -1.577072
H  -2.051947 0.754867 -1.02041
H  1.941269 0.705718 -2.85009
H  3.297239 1.667113 -2.178296
H  1.7014 2.444053 -2.461542
H  3.658459 0.632346 1.279006
H  1.260749 -1.345205 -1.74724
H  4.761499 -1.549057 1.832881
H  2.346575 -3.529549 -1.188962
H  4.109089 -3.640505 0.600842
H  2.535318 4.0896 1.510452
