program: Gaussian 09
title: 000210070
version: EM64L-G09RevD.01
frameworkgroup: C1[X(C16H18N2O)]
method: RPBEPBE
basis: SDD
operation: Freq
keyword: #p
keyword: freq=noraman
keyword: PBEPBE/SDD
title: #p freq=noraman PBEPBE/SDD
converged: YES YES NO NO
title: Mulliken charges:
elementType: O N N C C C C C C C C C C C C C C C C H H H H H H H H H H H H H H H H H H
charge: -0.227642 -0.231227 -0.094147 -0.399247 0.329575 -0.129203 -0.382978 0.233643 0.012086 0.485384 -0.357070 -0.362736 -0.407499 -0.459219 -0.431209 -0.189085 -0.207406 -0.618982 -0.635174 0.272344 0.215809 0.203414 0.213127 0.193398 0.229001 0.244955 0.264064 0.241406 0.243192 0.220292 0.227969 0.216972 0.187720 0.225941 0.212942 0.181168 0.278423
chargesum: 0.00000
title: Mulliken charges with hydrogens summed into heavy atoms:
elementType: O N N C C C C C C C C C C C C C C C C
charge: -0.227642 -0.231227 -0.094147 0.088906 0.329575 -0.129203 0.033563 0.233643 0.012086 0.485384 0.065329 -0.117782 -0.143436 -0.217813 -0.188017 0.031207 0.020562 0.011651 0.037360
polarizability: 2.50545971e+02 -6.42607291e+00 2.24111404e+02 2.37693734e+01 1.91195588e-01 1.06481713e+02
1716.lowfreq: -6.4021 -1.6465 -0.0006 -0.0005 -0.0005 5.8582 24.7432 50.1962 52.2280
frequency: 24.5995 50.1741 52.2030 81.1698 98.1298 128.5914 155.1985 175.3831 215.7070 230.8891 235.4404 262.8222 286.1405 290.4579 314.7699 373.2945 395.7655 406.5484 427.3795 444.2085 460.4279 470.5456 503.4383 529.6561 576.9848 588.9847 609.0018 634.1290 655.2090 712.9126 741.6977 773.7685 775.5464 796.7325 806.0159 838.6828 843.5474 881.2046 890.1726 902.1745 938.0328 968.0996 971.2193 993.3385 1000.1307 1015.1164 1026.5000 1040.2261 1045.7427 1059.8163 1080.5345 1093.9016 1096.5152 1136.5992 1152.5570 1169.6412 1180.4575 1214.0598 1232.6770 1236.5279 1253.3078 1270.7563 1284.8928 1305.0655 1321.0477 1339.7865 1342.8508 1364.2748 1380.1637 1409.0240 1419.2040 1420.9238 1441.1436 1454.1107 1463.5888 1465.6696 1467.9306 1470.9889 1477.2814 1478.8896 1482.9085 1485.6056 1501.3151 1603.3475 1621.1512 1634.5246 1644.5613 2841.5035 2854.5010 2875.5824 2983.4568 2996.8510 3015.0946 3020.9949 3032.1099 3049.6664 3064.1733 3071.9620 3087.7864 3128.1281 3129.5198 3147.0236 3149.0272 3163.2388 3164.4666
redmass: 4.4590 3.5627 3.8068 3.0449 3.6502 6.2731 4.2822 3.9966 1.2712 2.0620 1.8644 1.5278 3.0231 6.5613 2.7014 4.3500 2.1561 2.0319 2.8445 4.7740 3.2614 2.9622 4.1732 5.3330 4.6670 6.8640 3.9073 3.4974 6.4280 3.2413 2.7501 1.9494 1.6504 5.0606 3.1198 2.2129 3.4324 2.4140 1.4413 3.2106 1.4332 2.2537 1.3553 1.3701 3.6992 2.6554 2.1375 1.5423 1.9345 2.4355 2.3042 1.3135 2.0211 1.4221 1.5397 1.2048 1.2640 1.6686 1.8366 1.7583 2.1857 2.4934 1.8899 1.6226 2.0978 1.3027 1.4354 1.3314 3.4037 3.6522 1.9195 1.1410 1.1526 1.0944 1.3873 1.0800 5.8138 1.1096 1.9142 1.1046 1.0514 1.0539 4.4549 7.7053 9.6339 8.5278 8.7626 1.0576 1.0592 1.0684 1.0600 1.0621 1.0712 1.0743 1.0933 1.0962 1.1025 1.1006 1.1002 1.0870 1.0861 1.0927 1.0929 1.0978 1.0976
irintensity: 0.5829 0.8545 0.3260 2.3342 0.5021 2.5779 0.6028 4.4527 0.2503 0.5071 1.9598 1.1122 0.1240 8.3438 11.2910 2.3523 2.4175 5.3646 8.6016 3.9698 0.1051 1.4076 1.5383 5.6362 2.7522 11.9692 5.8464 3.7970 0.6208 1.7262 23.1564 73.0426 1.6896 1.2966 7.8981 74.1273 3.2180 4.8706 0.2823 3.5601 0.1183 26.5988 1.2927 1.8619 6.3030 43.9386 46.2829 7.8935 16.9765 7.1612 22.5497 4.6749 11.7722 10.6130 4.7286 6.0565 14.0113 4.0335 12.6202 2.2198 33.9280 16.0003 9.2438 44.8572 19.1729 4.9012 6.9150 2.5593 27.8587 28.7009 4.3755 2.8609 7.6917 4.4126 27.7820 13.1782 14.8168 5.4953 46.1484 25.7350 26.0518 1.1331 76.1999 179.9779 187.9403 52.2621 26.7996 90.4626 135.5443 202.0342 28.6200 33.9170 40.9804 46.0517 7.4891 73.6284 2.4923 33.7451 19.1806 2.6192 3.9652 12.4527 26.8531 29.6642 12.9279
temp: 298.150 k
press: 1.00000 atm
elementType: 8 7 7 6 6 6 6 6 6 6 6 6 6 6 6 6 6 6 6 1 1 1 1 1 1 1 1 1 1 1 1 1 1 1 1 1 1
symmnumber: 1
zpe: 800725.2 jmol-1
zpe.correction: 0.304980 hartree
zpe.thermalcorrener: 0.321879 hartree
zpe.thermalcorrenthalpy: 0.322824 hartree
zpe.thermalcorrgfe: 0.259891 hartree
zpe.sumelectzpe: -803.864382 hartree
zpe.sumelectthermal: -803.847483 hartree
zpe.sumelectthermalent: -803.846539 hartree
zpe.sumelectthermalfe: -803.909472 hartree
dipole: -1.5744 2.4616 -1.3333
dipole: 3.2118
quadrupole: -97.0886 -105.1902 -117.0694
quadrupole: 6.1019 0.9452 3.6308
quadrupole: 9.3608 1.2592 -10.6200 6.1019 0.9452 3.6308
hfenergy: -804.1693626 hartree
pointgroup: C01 [X(C16H18N2O1)]
dipole: 0.6534436 0.962231 0.4938638 debye
polarizability: 251.6612187|6.142204|223.7144788|21.0477409|-3.2625395|105.7633903 unknown
InChI: InChI=1S/C16H18N2O/c1-17(2)10-5-11-18-14-9-4-7-12-6-3-8-13(15(12)14)16(18)19/h3-4,6-9H,5,10-11H2,1-2H3
charge 0 multiplicity 1
37 atoms
O  -1.1732 -1.940239 -0.735953
N  -0.383066 0.317442 -0.629307
N  -4.228385 -0.078078 0.265355
C  -1.634978 1.004111 -0.988632
C  0.848253 0.954499 -0.339887
C  1.802384 -0.070052 -0.066097
C  -2.372466 1.601245 0.23437
C  1.196915 -1.344816 -0.174671
C  -0.242324 -1.109703 -0.539862
C  3.159017 0.161531 0.261192
C  -3.104648 0.501483 1.039025
C  1.255563 2.289436 -0.291976
C  1.968437 -2.487647 0.056292
C  3.572319 1.541746 0.311334
C  3.939728 -1.021227 0.496008
C  2.635781 2.551552 0.039072
C  3.351037 -2.298814 0.393925
C  -5.470241 0.708577 0.371959
C  -4.440671 -1.520451 0.504743
H  -2.302326 0.259728 -1.459718
H  -1.399673 1.787817 -1.733515
H  -3.106356 2.34745 -0.127278
H  -1.658685 2.139468 0.889331
H  -3.446213 0.916036 2.019967
H  -2.386771 -0.307442 1.267705
H  0.575152 3.123053 -0.492407
H  1.541573 -3.493167 -0.017293
H  4.607462 1.801746 0.558422
H  5.001392 -0.933051 0.755897
H  2.959337 3.598204 0.078332
H  3.971122 -3.183288 0.578175
H  -5.28154 1.764188 0.105089
H  -5.916813 0.690843 1.400062
H  -6.223702 0.313635 -0.333471
H  -5.222468 -1.894454 -0.18195
H  -4.76397 -1.757443 1.550495
H  -3.506775 -2.064919 0.28537
