program: Gaussian 09
title: 000210035
version: EM64L-G09RevD.01
frameworkgroup: C1[X(C10H13NO3S)]
method: RPBEPBE
basis: SDD
operation: Freq
keyword: #p
keyword: freq=noraman
keyword: PBEPBE/SDD
title: #p freq=noraman PBEPBE/SDD
converged: YES YES NO NO
title: Mulliken charges:
elementType: S O O O N C C C C C C C C C C H H H H H H H H H H H H H
charge: 0.884173 -0.558409 -0.555960 -0.264145 -0.629418 -0.260164 -0.061954 -0.653988 -0.657187 -0.262890 -0.256361 -0.342694 -0.346606 0.314104 0.153063 0.266844 0.270885 0.223668 0.241931 0.229823 0.262503 0.235742 0.295294 0.287232 0.231075 0.287155 0.323540 0.342745
chargesum: 0.00000
title: Mulliken charges with hydrogens summed into heavy atoms:
elementType: S O O O N C C C C C C C C C C
charge: 0.884173 -0.558409 -0.555960 -0.264145 0.036867 0.006680 -0.061954 0.082496 0.070880 0.032404 0.030871 -0.111619 -0.059452 0.314104 0.153063
polarizability: 2.15673842e+02 3.43362748e+00 1.41522313e+02 3.70712369e-01 9.58025088e+00 1.02719070e+02
1716.lowfreq: -12.7556 -3.4219 -0.0020 0.0016 0.0020 1.8050 28.7799 35.8365 43.1785
frequency: 28.6283 35.6075 43.0552 58.4579 104.7346 107.5055 178.2676 194.9345 196.3756 202.7758 214.5795 237.1341 262.4248 282.9711 335.3198 357.6918 380.6275 405.4445 416.0724 438.5166 478.5134 488.7174 510.5553 527.0370 593.5566 607.0988 618.8548 694.3689 741.7380 758.7723 789.2841 854.0491 870.7367 872.5097 909.7513 934.0590 944.1848 975.3732 995.1467 998.1872 1039.7885 1049.2943 1051.7220 1112.4648 1119.1195 1136.9957 1166.2084 1182.7526 1225.8008 1291.7938 1309.5020 1351.1387 1382.9990 1384.2133 1388.1579 1398.0352 1453.9337 1467.3755 1469.0567 1470.7930 1487.3258 1571.9424 1592.9323 1597.1011 1637.5314 2982.7076 2986.5391 3047.0147 3075.4356 3081.8017 3094.5788 3102.6845 3134.5764 3150.2722 3157.0447 3170.9447 3525.8838 3677.5257
redmass: 4.0385 3.0920 4.7597 4.1521 5.3437 7.7529 2.9175 5.3338 1.2840 3.8435 2.8217 1.5706 4.7760 4.6013 5.8046 2.7989 6.0764 2.8728 3.9599 3.5204 3.1671 1.2577 4.9966 4.2413 1.3177 4.3790 6.8515 3.5691 4.8121 3.6549 13.3371 1.3645 2.6881 1.5226 6.4420 1.2012 1.3717 1.3692 2.3088 2.0745 1.3795 1.9250 2.6274 1.9165 1.7934 2.2060 1.8367 1.1332 1.2862 1.2532 1.5692 3.8545 1.2156 3.9983 5.6550 1.1921 1.0434 1.0646 1.0687 2.1883 1.0533 3.6877 5.2579 2.9182 2.2498 1.0357 1.0361 1.0874 1.0982 1.0982 1.1006 1.1004 1.0883 1.0891 1.0960 1.0965 1.0451 1.1040
irintensity: 8.6674 3.2140 3.6439 5.0253 1.9850 4.3252 2.0703 0.9856 1.8100 1.9336 13.5626 9.9517 6.8599 13.3385 2.8867 9.1049 15.7801 1.0993 2.1072 10.0747 16.4050 81.3067 23.8005 121.8794 77.5115 54.8446 0.4454 64.3238 14.9899 21.6524 70.1251 10.9369 1.7310 26.3581 65.2072 15.8450 1.8210 0.4092 7.2653 4.9594 30.9463 1.4280 43.1552 2.2711 12.3957 0.3768 37.8981 0.1830 22.9679 1.3673 0.3614 227.8189 34.6029 30.7362 20.9598 25.2767 9.9239 17.5987 3.1563 1.0226 19.3304 88.1797 42.6318 28.1651 246.8467 11.2510 21.9461 5.1091 10.4058 9.0716 11.8850 13.8385 9.1614 1.6136 8.8735 0.1119 48.0853 32.7771
temp: 298.150 k
press: 1.00000 atm
elementType: 16 8 8 8 7 6 6 6 6 6 6 6 6 6 6 1 1 1 1 1 1 1 1 1 1 1 1 1
symmnumber: 1
zpe: 563253.3 jmol-1
zpe.correction: 0.214532 hartree
zpe.thermalcorrener: 0.230905 hartree
zpe.thermalcorrenthalpy: 0.231849 hartree
zpe.thermalcorrgfe: 0.169396 hartree
zpe.sumelectzpe: -1066.086285 hartree
zpe.sumelectthermal: -1066.069912 hartree
zpe.sumelectthermalent: -1066.068968 hartree
zpe.sumelectthermalfe: -1066.131421 hartree
dipole: -1.5713 -3.6498 3.0643
dipole: 5.0179
quadrupole: -92.2178 -95.7323 -104.1181
quadrupole: 14.3909 26.0294 1.3020
quadrupole: 5.1383 1.6238 -6.7621 14.3909 26.0294 1.3020
hfenergy: -1066.300817 hartree
pointgroup: C01 [X(C10H13N1O3S1)]
dipole: -0.6316106 -1.6754922 0.8314301 debye
polarizability: 215.7145296|2.6292649|134.9130726|1.4222719|17.413268|109.2876232 unknown
InChI: InChI=1S/C10H13NO3S/c1-7(2)15(13,14)9-5-3-8(4-6-9)10(11)12/h3-7H,11H2,1-2H3
charge 0 multiplicity 1
28 atoms
S  2.265831 0.20436 -0.609096
O  2.619542 -0.931569 -1.740436
O  2.63598 1.788054 -0.821183
O  -4.394716 0.717285 1.150561
N  -4.616203 -0.90999 -0.485335
C  3.123319 -0.363741 1.111191
C  0.39321 0.099571 -0.308099
C  4.571969 0.109659 1.012858
C  2.909347 -1.867679 1.243848
C  -0.274284 -1.056616 -0.740927
C  -0.257273 1.1980 0.279638
C  -1.673617 -1.118671 -0.558802
C  -1.652954 1.114056 0.464865
C  -2.367952 -0.036877 0.043486
C  -3.860457 -0.042369 0.286344
H  2.535392 0.230132 1.833652
H  4.622999 1.179502 0.746128
H  5.066611 -0.030768 1.992376
H  5.129597 -0.470532 0.256878
H  3.44736 -2.231083 2.139567
H  3.31435 -2.393715 0.360867
H  1.843457 -2.132305 1.357793
H  0.287913 -1.86261 -1.224753
H  0.306009 2.096766 0.551814
H  -2.203314 -2.028724 -0.862424
H  -2.214565 1.927805 0.934231
H  -4.231531 -1.436344 -1.266736
H  -5.623222 -0.929197 -0.326607
