program: Gaussian 09
title: 000210038
version: EM64L-G09RevD.01
frameworkgroup: C1[X(C14H21NO3S)]
method: RPBEPBE
basis: SDD
operation: Freq
keyword: #p
keyword: freq=noraman
keyword: PBEPBE/SDD
title: #p freq=noraman PBEPBE/SDD
converged: YES YES NO NO
title: Mulliken charges:
elementType: S O O O N C C C C C C C C C C C C C C H H H H H H H H H H H H H H H H H H H H H
charge: 0.855384 -0.566499 -0.563233 -0.301617 -0.097527 -0.263223 -0.265953 0.336292 -0.660424 -0.665985 0.134639 -0.260782 -0.343058 -0.342081 -0.327227 -0.232762 -0.230287 -0.654108 -0.658149 0.339270 0.223049 0.238572 0.263021 0.226939 0.255917 0.239565 0.306655 0.201882 0.250381 0.231694 0.252199 0.251319 0.243362 0.237837 0.262769 0.211113 0.209346 0.221717 0.215617 0.224377
chargesum: 0.00000
title: Mulliken charges with hydrogens summed into heavy atoms:
elementType: S O O O N C C C C C C C C C C C C C C
charge: 0.855384 -0.566499 -0.563233 -0.301617 -0.097527 0.076046 -0.265953 0.336292 0.064218 0.056436 0.134639 0.045873 0.109205 0.141812 -0.075908 0.010600 0.007550 0.029120 0.003562
polarizability: 2.17103975e+02 -1.35636575e+00 2.23242282e+02 9.35980617e-02 1.91177498e+00 1.42498644e+02
1716.lowfreq: -0.0017 -0.0016 -0.0003 2.9352 4.5398 10.3784 29.1529 41.9995 51.7082
frequency: 28.9954 41.8991 51.5324 58.3477 61.5231 71.1202 86.0758 95.7268 132.1483 153.5110 159.7668 166.3579 176.2243 192.6165 195.5367 207.1336 217.3750 218.7683 230.4374 274.0744 285.6681 310.0371 325.5514 353.0149 368.6564 372.9854 401.7716 418.4457 462.1004 474.0253 505.3354 524.8419 565.3291 616.1894 647.3087 690.9894 706.8069 752.0804 766.5472 774.6797 780.8951 784.4594 859.8855 871.8608 894.0675 898.3976 939.0659 942.8939 947.7271 968.4289 996.3625 1000.9156 1007.5879 1029.5460 1057.7145 1070.5152 1080.4763 1092.8852 1103.6809 1121.6355 1148.1950 1169.8866 1171.7634 1189.9367 1207.7018 1251.2987 1258.9734 1277.2145 1298.1121 1344.4463 1344.6424 1355.9548 1368.0020 1383.0782 1390.2176 1391.7368 1396.1142 1418.6167 1421.0908 1452.1490 1454.5620 1456.4023 1462.9205 1464.0061 1467.6066 1470.9573 1471.8267 1477.6502 1482.4765 1485.6752 1556.4071 1565.6789 1603.4349 2982.3449 2984.9080 2986.8369 2993.2552 3007.2975 3012.1274 3042.1025 3072.1715 3073.4654 3074.5762 3079.4384 3086.6561 3090.6520 3094.9719 3097.5092 3100.3738 3111.9729 3133.1554 3139.5497 3151.5409 3168.8770
redmass: 3.1583 3.3121 3.8314 3.3205 2.9863 2.8673 4.3343 2.7275 7.9458 2.3954 2.4259 1.9390 1.4857 1.4159 2.8747 2.4725 2.2596 1.8027 2.6346 6.6794 3.4930 2.9836 3.0149 3.2726 4.0334 4.1044 4.3582 2.8966 4.5564 3.3944 3.6922 6.7437 3.5712 4.7679 5.4729 5.2136 7.4755 3.1584 1.2049 1.2929 1.4736 8.0504 2.4720 2.6831 1.6564 5.0166 1.3392 2.0458 1.1781 1.3924 4.1054 1.3773 3.6531 2.2094 1.4495 2.1841 1.8666 2.0611 1.7760 1.5979 2.5381 1.7959 1.0943 2.5231 2.5665 1.4471 1.1998 1.3966 1.3572 1.2560 1.3688 1.3189 5.7640 1.2223 1.2173 1.2114 1.1939 2.4337 2.5574 1.0477 1.1320 2.5861 1.0815 1.0556 1.0491 1.0865 1.0477 1.0577 1.0749 1.0543 5.7092 6.0191 7.2772 1.0359 1.0360 1.0356 1.0362 1.0661 1.0626 1.0903 1.0973 1.1004 1.0978 1.0976 1.0981 1.0995 1.1010 1.1004 1.1003 1.1012 1.0860 1.0898 1.0942 1.1004
irintensity: 1.3545 1.6305 2.7412 0.7115 1.0015 1.6153 5.9870 1.8930 2.5578 1.6431 0.8137 1.1924 0.9086 0.9807 2.6410 3.9951 3.8552 0.3530 21.5604 8.3896 4.7866 3.1016 0.5074 12.1825 11.2683 2.7089 7.0994 8.2813 11.8208 30.1330 7.6638 41.4761 4.1681 3.5821 4.2611 6.5143 9.7205 18.1020 14.7701 2.9680 92.0803 32.9832 9.6948 2.1610 19.1607 75.7068 0.1616 8.4006 9.8137 2.0773 1.1623 0.1250 4.0974 7.7023 73.0531 6.9375 2.6335 43.9150 22.6260 3.8382 0.5324 25.7447 1.1370 1.9579 24.2595 22.3896 6.7896 60.8172 30.2587 2.5756 0.1103 10.1627 4.1444 31.0142 16.6078 32.8857 27.8164 20.8214 69.5952 7.2794 27.1917 6.6109 15.2509 10.6361 1.9432 0.4837 4.6281 13.3054 18.3992 18.8244 246.6174 53.5117 5.6549 10.5599 26.7866 22.8074 23.9786 22.4082 39.9222 21.5710 3.0769 5.6512 8.9917 10.0281 33.1708 43.6822 7.1183 37.4119 8.2672 28.6577 1.7010 8.1918 5.6013 29.2213
temp: 298.150 k
press: 1.00000 atm
elementType: 16 8 8 8 7 6 6 6 6 6 6 6 6 6 6 6 6 6 6 1 1 1 1 1 1 1 1 1 1 1 1 1 1 1 1 1 1 1 1 1
symmnumber: 1
zpe: 853733.2 jmol-1
zpe.correction: 0.325170 hartree
zpe.thermalcorrener: 0.347297 hartree
zpe.thermalcorrenthalpy: 0.348242 hartree
zpe.thermalcorrgfe: 0.273607 hartree
zpe.sumelectzpe: -1222.970449 hartree
zpe.sumelectthermal: -1222.948322 hartree
zpe.sumelectthermalent: -1222.947377 hartree
zpe.sumelectthermalfe: -1223.022012 hartree
dipole: -3.0559 2.1605 -2.5259
dipole: 4.5151
quadrupole: -109.2488 -107.0875 -135.3734
quadrupole: -2.2899 -11.3801 0.7210
quadrupole: 7.9878 10.1490 -18.1368 -2.2899 -11.3801 0.7210
hfenergy: -1223.295619 hartree
pointgroup: C01 [X(C14H21N1O3S1)]
dipole: 0.9769524 1.1509553 0.9361727 debye
polarizability: 216.8223696|-0.3207838|223.2936451|-0.8227082|-4.6387685|142.7288861 unknown
InChI: InChI=1S/C14H21NO3S/c1-5-15(6-2)14(16)12-9-7-8-10-13(12)19(17,18)11(3)4/h7-11H,5-6H2,1-4H3
charge 0 multiplicity 1
40 atoms
S  -1.632128 -0.84758 -0.82583
O  -2.986749 -0.605683 -1.724216
O  -0.307239 -1.548833 -1.503223
O  0.698304 -0.822625 1.7215
N  2.276717 -0.202092 0.118099
C  -2.15155 -1.914202 0.787878
C  -1.104501 0.889725 -0.225372
C  0.165537 1.090872 0.356317
C  -2.24159 -3.356422 0.294308
C  -3.442719 -1.301145 1.318618
C  1.067771 -0.062817 0.758926
C  -2.006801 1.927486 -0.500206
C  3.153199 -1.327614 0.536416
C  2.615916 0.487785 -1.150068
C  0.510044 2.424099 0.699448
C  -1.64172 3.247759 -0.147979
C  -0.385864 3.489299 0.454694
C  2.812469 -2.642545 -0.197729
C  3.745761 1.526629 -0.998681
H  -1.269788 -1.725226 1.425667
H  -2.393238 -4.019569 1.166952
H  -3.089626 -3.494912 -0.399441
H  -1.311066 -3.662502 -0.214278
H  -3.789255 -1.902088 2.180752
H  -4.232905 -1.31397 0.546958
H  -3.298227 -0.26411 1.668641
H  -2.953433 1.692126 -1.000055
H  4.201022 -1.029688 0.347375
H  3.020254 -1.46247 1.622893
H  2.90604 -0.286772 -1.885154
H  1.705334 0.963508 -1.547883
H  1.477411 2.616843 1.175991
H  -2.329289 4.076145 -0.347128
H  -0.100297 4.50952 0.73278
H  1.759286 -2.914811 -0.021402
H  2.958793 -2.553399 -1.288796
H  3.461198 -3.45769 0.171609
H  3.440601 2.35199 -0.331565
H  4.664478 1.072811 -0.585395
H  3.996049 1.956563 -1.98562
