program: Gaussian 09
title: 000210037
version: EM64L-G09RevD.01
frameworkgroup: C1[X(C14H21NO3S)]
method: RPBEPBE
basis: SDD
operation: Freq
keyword: #p
keyword: freq=noraman
keyword: PBEPBE/SDD
title: #p freq=noraman PBEPBE/SDD
converged: YES YES NO NO
title: Mulliken charges:
elementType: S O O O N C C C C C C C C C C C C C C H H H H H H H H H H H H H H H H H H H H H
charge: 0.887013 -0.555774 -0.560338 -0.267791 -0.133430 -0.261728 -0.072698 -0.653805 -0.657685 0.303417 -0.251630 -0.269971 0.123648 -0.370769 -0.358414 -0.331938 -0.382805 -0.664197 -0.644767 0.261839 0.221115 0.242692 0.270146 0.227048 0.264015 0.235248 0.293214 0.290162 0.273379 0.265072 0.259654 0.202206 0.248375 0.221453 0.206881 0.255818 0.218170 0.219417 0.226931 0.220830
chargesum: 0.00000
title: Mulliken charges with hydrogens summed into heavy atoms:
elementType: S O O O N C C C C C C C C C C C C C C
charge: 0.887013 -0.555774 -0.560338 -0.267791 -0.133430 0.000110 -0.072698 0.080147 0.068626 0.303417 0.041584 0.020191 0.123648 -0.097390 -0.093342 0.129922 0.087022 0.016672 0.022411
polarizability: 2.74320365e+02 7.28065315e+00 1.58009042e+02 2.89758132e-01 -4.97906761e+00 1.70816627e+02
1716.lowfreq: -13.9656 -4.2156 0.0010 0.0011 0.0020 5.7183 14.9263 29.4944 32.7971
frequency: 12.6625 29.4227 32.6946 38.5294 46.9010 61.9676 79.0150 88.5086 112.4589 129.2944 161.4296 170.3855 187.4748 191.7712 215.5154 220.6701 226.9677 238.7073 252.3143 274.0391 302.2324 317.1141 335.3743 353.9427 363.6526 385.7870 408.9920 421.0511 444.1401 485.3874 503.9714 519.8640 558.8611 615.9571 625.8673 684.6087 716.9251 747.8957 774.5807 784.1426 787.0627 854.1739 859.6444 868.8009 870.8384 909.3358 933.4404 940.3923 943.0032 973.0757 987.7443 995.1144 1005.0853 1040.4342 1053.3459 1067.3701 1080.6761 1087.6197 1097.0565 1109.5806 1137.0243 1166.6098 1181.4523 1190.0159 1210.4723 1225.7120 1275.3967 1290.6728 1306.0003 1308.9384 1344.6995 1357.1945 1372.7252 1382.6173 1384.8838 1386.0048 1390.2483 1397.7561 1408.9631 1451.6681 1454.2268 1466.4030 1466.9915 1467.3912 1468.9545 1470.6192 1476.7591 1483.6356 1485.0237 1487.6904 1552.4004 1585.1643 1591.5817 2982.0759 2985.3635 2986.0677 2986.2308 3002.3060 3014.2574 3047.6984 3068.5799 3074.6895 3076.5650 3081.2803 3084.0805 3086.0559 3094.3768 3101.9666 3102.8771 3104.0861 3137.0139 3147.4813 3156.9336 3167.4228
redmass: 3.6221 3.6976 2.7543 3.0488 3.9932 3.4441 3.5688 4.0253 6.2295 4.0353 3.7959 2.4433 2.1346 1.5981 2.9376 1.1519 1.4741 1.5308 3.2879 3.8822 2.6450 3.7507 5.9202 2.7683 3.5688 3.3526 2.9902 3.8281 3.5159 3.6233 4.9039 4.7488 3.5251 6.7654 4.4731 5.3488 6.6189 3.5155 1.2835 1.2031 11.3268 1.9229 1.4267 1.6420 2.6725 6.4318 1.2030 2.0841 1.3761 1.3489 1.3854 4.4393 3.0595 1.3644 2.7467 2.0824 2.0434 1.9088 1.8271 1.3580 2.2073 1.8385 1.1324 2.7917 2.5844 1.2862 1.4807 1.2719 1.3387 1.5574 1.2394 1.2964 4.8610 1.2257 1.2240 3.5807 1.2442 1.1922 2.3233 1.0434 1.1358 1.0796 1.0483 1.1730 1.6267 1.0422 1.1749 1.0765 1.0893 1.0528 5.9884 7.0397 6.5232 1.0358 1.0354 1.0361 1.0357 1.0673 1.0600 1.0874 1.1022 1.0982 1.0977 1.0981 1.1002 1.0984 1.1006 1.1006 1.1004 1.1009 1.0882 1.0887 1.0965 1.0969
irintensity: 0.8294 0.3399 0.1381 0.0531 0.3649 0.9427 1.6424 3.8564 3.4227 1.7262 6.8001 0.3038 0.5371 1.9264 11.4087 1.4488 6.1517 7.4988 2.5470 6.0522 2.3833 2.4736 14.0040 3.9004 2.3934 20.7581 1.1034 0.6752 5.8172 14.7668 35.4666 44.1613 30.6891 0.6860 15.9463 13.1881 9.5121 11.6747 3.7124 6.3012 94.8460 38.2005 3.0072 26.5954 1.6733 61.6708 15.0087 7.3292 1.5363 0.2013 0.7362 11.7255 0.3889 38.5449 54.4727 22.4466 1.9311 35.6251 16.8758 6.6530 0.2538 37.5540 2.5770 10.0770 15.4559 21.8054 103.5686 8.8704 29.4954 0.2847 10.8441 12.0608 2.0525 29.6395 17.3177 12.5156 29.8898 31.6028 130.2176 10.0273 28.4089 12.8175 7.4573 6.9173 3.3184 14.0459 8.3835 8.5627 12.4286 18.7228 208.6146 5.7629 8.2907 11.8568 19.7358 30.7616 22.3114 30.2998 34.6713 6.0550 5.2858 11.3924 4.0056 9.7966 42.6854 34.7185 13.1621 17.3027 14.2741 58.1089 4.2478 1.5282 5.7569 3.2552
temp: 298.150 k
press: 1.00000 atm
elementType: 16 8 8 8 7 6 6 6 6 6 6 6 6 6 6 6 6 6 6 1 1 1 1 1 1 1 1 1 1 1 1 1 1 1 1 1 1 1 1 1
symmnumber: 1
zpe: 853524.6 jmol-1
zpe.correction: 0.325090 hartree
zpe.thermalcorrener: 0.347317 hartree
zpe.thermalcorrenthalpy: 0.348261 hartree
zpe.thermalcorrgfe: 0.271019 hartree
zpe.sumelectzpe: -1222.963139 hartree
zpe.sumelectthermal: -1222.940912 hartree
zpe.sumelectthermalent: -1222.939968 hartree
zpe.sumelectthermalfe: -1223.017210 hartree
dipole: -3.5059 8.4134 -1.6205
dipole: 9.2576
quadrupole: -121.3960 -129.2061 -123.9995
quadrupole: 9.7298 8.6311 1.4256
quadrupole: 3.4712 -4.3389 0.8677 9.7298 8.6311 1.4256
hfenergy: -1223.288229 hartree
pointgroup: C01 [X(C14H21N1O3S1)]
dipole: -1.3036378 -3.2862836 0.8755469 debye
polarizability: 274.6015002|-4.2986036|157.0408068|1.1347445|-3.9841869|171.5037271 unknown
InChI: InChI=1S/C14H21NO3S/c1-5-15(6-2)14(16)12-7-9-13(10-8-12)19(17,18)11(3)4/h7-11H,5-6H2,1-4H3
charge 0 multiplicity 1
40 atoms
S  3.440716 0.647285 0.197856
O  4.039526 1.201691 -1.225505
O  3.706084 1.425645 1.618328
O  -3.191116 1.268056 -1.316142
N  -3.519907 -0.492851 0.172142
C  4.111758 -1.224874 0.4393
C  1.561216 0.495757 -0.008345
C  5.518901 -1.078426 1.015485
C  4.007111 -1.919071 -0.914659
C  -1.207792 0.345167 -0.309298
C  1.03473 0.440482 -1.309881
C  0.764954 0.526888 1.147868
C  -2.705708 0.392523 -0.524962
C  -0.367836 0.374819 -1.452106
C  -0.635489 0.439211 0.987097
C  -4.990464 -0.300886 0.041131
C  -3.05493 -1.742696 0.822197
C  -5.521234 0.759878 1.027081
C  -3.179162 -2.977029 -0.100292
H  3.390296 -1.602943 1.185536
H  5.896887 -2.076115 1.308388
H  6.211056 -0.652083 0.268196
H  5.517708 -0.428259 1.90737
H  4.446159 -2.931646 -0.837226
H  4.571024 -1.355652 -1.679449
H  2.961411 -2.026177 -1.25255
H  1.704236 0.493206 -2.175148
H  1.226715 0.656437 2.132521
H  -0.825498 0.375814 -2.446292
H  -1.285539 0.488434 1.867802
H  -5.207746 0.015808 -0.994038
H  -5.47805 -1.276208 0.216966
H  -2.004603 -1.625391 1.129303
H  -3.649753 -1.894201 1.74318
H  -5.309702 0.47849 2.074753
H  -5.052102 1.73672 0.821241
H  -6.615082 0.873295 0.914271
H  -4.219498 -3.128937 -0.439129
H  -2.541197 -2.859798 -0.994156
H  -2.860076 -3.888662 0.437565
