program: Gaussian 09
title: 000210028
version: EM64L-G09RevD.01
frameworkgroup: C1[X(C15H24N2O3)]
method: RPBEPBE
basis: SDD
operation: Freq
keyword: #p
keyword: freq=noraman
keyword: PBEPBE/SDD
title: #p freq=noraman PBEPBE/SDD
converged: YES YES NO NO
title: Mulliken charges:
elementType: O O O N N C C C C C C C C C C C C C C C H H H H H H H H H H H H H H H H H H H H H H H H
charge: -0.445644 -0.460149 -0.251129 -0.442413 -0.472070 0.262934 -0.180923 -0.374980 -0.417430 -0.761626 0.151666 -0.739452 0.162551 0.351590 0.358896 -0.430091 -0.418244 -0.837433 -0.825086 -0.235998 0.276223 0.290497 0.199116 0.214670 0.220633 0.262383 0.228103 0.205459 0.235313 0.200055 0.227439 0.272712 0.351339 0.378679 0.347624 0.230228 0.230931 0.244159 0.212307 0.233664 0.215902 0.211883 0.291973 0.223738
chargesum: 0.00000
title: Mulliken charges with hydrogens summed into heavy atoms:
elementType: O O O N N C C C C C C C C C C C C C C C
charge: -0.066965 -0.112525 -0.251129 -0.166190 -0.120730 0.262934 0.109574 0.038806 0.065587 -0.092751 0.151666 -0.039246 0.162551 0.351590 0.358896 -0.199863 -0.187312 -0.147303 -0.105328 -0.012260
polarizability: 2.40086971e+02 5.28715342e+00 1.99441358e+02 2.25552304e+00 -1.93817815e-01 1.29037418e+02
1716.lowfreq: -7.6764 -0.0005 0.0005 0.0005 5.8910 6.7941 24.7147 33.4660 49.1532
frequency: 23.5249 32.7727 49.0940 54.2547 74.4181 99.7889 109.0486 131.7008 146.9514 168.6914 172.7719 180.6672 196.3170 220.4236 228.8433 233.0362 236.6938 249.1259 284.4485 288.0406 310.8181 313.5310 316.1361 335.0946 349.0968 359.2377 408.8265 449.2297 467.1920 484.0636 517.5424 519.4694 532.3327 551.1787 580.9326 599.1644 655.6128 670.3763 690.0505 715.0097 747.3935 757.3662 775.9269 828.2686 849.2234 875.0110 878.1180 895.6544 897.4162 932.7745 934.2071 943.6210 968.1648 971.6242 979.2719 988.6263 1001.5224 1040.5954 1042.7742 1048.2542 1054.7777 1072.7254 1090.5665 1099.9973 1125.5183 1151.9620 1176.1505 1183.6207 1184.7234 1223.6004 1232.5977 1254.5616 1261.4312 1278.6212 1285.9237 1306.4647 1327.3773 1354.8988 1369.5600 1371.7766 1373.2888 1379.4519 1386.6057 1398.1927 1399.3796 1433.6493 1446.7954 1450.1505 1453.6102 1455.1810 1459.7953 1464.0158 1468.8324 1470.3434 1476.7575 1479.6767 1484.1370 1486.6090 1493.2318 1600.0225 1603.3527 1625.8969 2958.2514 2959.1287 2972.8943 2974.4840 2975.9369 3002.4306 3018.1750 3036.4990 3055.6878 3061.4678 3067.4829 3074.1040 3079.9420 3085.2360 3085.6352 3102.8257 3105.0914 3119.8602 3129.8094 3155.8633 3298.6759 3428.0956 3480.7294 3582.9821
redmass: 3.7343 4.9760 4.2787 4.5227 4.3358 3.8379 4.3007 5.0312 3.2773 1.0635 1.5150 2.6463 2.1589 2.5016 1.3438 1.4984 2.0308 1.8245 1.6312 2.6322 3.3545 2.7757 2.7556 3.7170 2.6314 2.5330 2.9410 2.5921 3.2355 4.0005 3.3923 4.0518 3.7864 4.1589 3.5133 3.8234 1.6884 1.3141 4.4872 3.5748 3.7260 3.4416 1.2265 1.8500 2.0493 1.9261 2.1330 1.8077 1.3114 1.7967 1.9907 2.1577 4.6642 1.3570 1.8247 1.6289 3.4930 1.7586 1.7674 1.7186 1.6067 2.2701 1.5197 1.6724 2.4471 1.4261 1.1796 2.8676 3.2805 2.1805 2.5814 2.0477 1.6740 2.3520 1.3170 1.2690 1.2278 1.2722 5.6969 1.2116 1.2172 1.2048 1.2198 1.2578 1.2613 2.0124 1.2290 1.3998 1.1819 1.0860 1.2442 1.0964 1.0958 1.0678 1.4627 1.0592 1.0838 1.2630 1.5430 7.0240 5.5626 7.7102 1.0661 1.0412 1.0371 1.0367 1.0388 1.0651 1.0840 1.0931 1.0965 1.0981 1.0970 1.0972 1.0999 1.0997 1.0979 1.1002 1.0992 1.0855 1.0917 1.0995 1.0752 1.0747 1.0652 1.0665
irintensity: 0.0693 0.7292 1.8404 1.4953 0.4494 6.6097 0.3201 6.6608 6.8747 0.8802 1.5004 1.5617 5.2784 0.4619 0.0912 1.9345 0.7306 1.0583 39.3588 16.6064 9.5117 25.7525 11.5268 21.1003 9.0314 24.4345 3.1276 2.6718 1.0480 18.6734 0.4110 4.1724 6.1172 0.0812 4.2783 2.4376 6.1717 275.8536 5.1281 7.0984 3.0782 5.6884 55.2580 27.9384 49.9332 7.0694 46.1983 10.7538 0.2094 3.0568 20.8934 44.8473 97.3387 1.9180 2.9245 5.0332 40.9446 3.7182 18.5311 1.5395 7.9268 1.2378 27.2697 26.1607 53.8065 24.5459 1.0062 6.5745 57.0216 4.4088 14.7079 23.8009 2.3294 3.8909 2.4161 17.9145 1.6739 12.3811 19.1152 36.1381 5.6713 23.0384 25.7888 32.1744 2.9585 39.5646 13.2348 43.0874 19.5776 6.1639 14.6773 31.7679 23.1077 8.9975 183.3656 4.8348 60.7763 16.7116 224.3583 12.4605 20.3732 160.5153 66.0989 45.0996 38.0145 16.8209 41.2749 41.7335 14.4384 21.0591 15.1302 7.0179 50.2008 28.7423 38.8423 19.6336 28.0049 13.5153 12.6099 0.6182 27.4065 38.6087 284.7444 0.4671 40.9973 9.0184
temp: 298.150 k
press: 1.00000 atm
elementType: 8 8 8 7 7 6 6 6 6 6 6 6 6 6 6 6 6 6 6 6 1 1 1 1 1 1 1 1 1 1 1 1 1 1 1 1 1 1 1 1 1 1 1 1
symmnumber: 1
zpe: 974169.6 jmol-1
zpe.correction: 0.371042 hartree
zpe.thermalcorrener: 0.393166 hartree
zpe.thermalcorrenthalpy: 0.394110 hartree
zpe.thermalcorrgfe: 0.320142 hartree
zpe.sumelectzpe: -919.613570 hartree
zpe.sumelectthermal: -919.591445 hartree
zpe.sumelectthermalent: -919.590501 hartree
zpe.sumelectthermalfe: -919.664469 hartree
dipole: 3.0785 -3.7003 5.4816
dipole: 7.2950
quadrupole: -113.7195 -116.3152 -128.5924
quadrupole: -6.1353 9.4208 6.1126
quadrupole: 5.8228 3.2272 -9.0501 -6.1353 9.4208 6.1126
hfenergy: -919.9846113 hartree
pointgroup: C01 [X(C15H24N2O3)]
dipole: -0.9784056 1.395051 2.3095187 debye
polarizability: 240.6964789|-0.0309003|198.0550696|-3.4829291|7.0294668|129.8141981 unknown
InChI: InChI=1S/C15H24N2O3/c1-10-6-5-7-11(2)13(10)16-14(20)12(3)17-15(4,8-18)9-19/h5-7,12,16-19H,8-9H2,1-4H3
charge 0 multiplicity 1
44 atoms
O  -4.200427 0.055408 -1.270461
O  -3.350054 2.678764 -0.767924
O  0.431981 -1.929659 -1.599401
N  -1.762853 -0.295949 0.910786
N  0.793606 -0.400638 0.165473
C  -2.841939 0.73058 0.76689
C  -1.486038 -1.231883 -0.223876
C  -4.194116 0.180656 0.18864
C  -2.287941 1.831833 -0.185484
C  -3.114595 1.3058 2.17598
C  0.017679 -1.228042 -0.628387
C  -1.919299 -2.687129 0.080172
C  2.200067 -0.146425 0.070514
C  2.627317 1.21636 0.031287
C  3.145957 -1.215229 0.069557
C  4.010883 1.498069 -0.035298
C  4.522948 -0.886688 -0.014998
C  1.614246 2.34769 0.042185
C  2.722966 -2.663661 0.197009
C  4.959439 0.45282 -0.070375
H  -1.864197 -0.809774 1.797453
H  -2.055333 -0.89446 -1.109956
H  -5.028717 0.83262 0.522833
H  -4.37411 -0.835964 0.578695
H  -1.536022 2.447492 0.344798
H  -1.809401 1.366513 -1.060778
H  -3.636527 0.568216 2.815586
H  -3.758083 2.2039 2.125491
H  -2.166683 1.584819 2.670287
H  -1.455618 -3.051995 1.01791
H  -3.017254 -2.75769 0.173456
H  -1.593057 -3.347679 -0.739941
H  0.19827 0.149206 0.812407
H  -4.193207 0.985633 -1.627174
H  -3.710691 3.293865 -0.082671
H  4.342374 2.542523 -0.072577
H  5.257321 -1.700735 -0.021523
H  0.869953 2.227836 -0.767461
H  1.052645 2.396267 0.997393
H  2.113938 3.321621 -0.093277
H  3.589182 -3.305665 0.431392
H  1.96814 -2.79155 0.996173
H  2.251486 -3.016256 -0.738096
H  6.029162 0.681483 -0.131216
