program: Gaussian 09
title: 000210047
version: EM64L-G09RevD.01
frameworkgroup: C1[X(C22H27NO5S)]
method: RPBEPBE
basis: SDD
operation: Freq
keyword: #p
keyword: freq=noraman
keyword: PBEPBE/SDD
title: #p freq=noraman PBEPBE/SDD
converged: NO YES NO NO
title: Mulliken charges:
elementType: S O O O O O N C C C C C C C C C C C C C C C C C C C C C C H H H H H H H H H H H H H H H H H H H H H H H H H H H
charge: 0.883947 -0.298946 -0.299609 -0.301583 -0.562526 -0.560397 -0.126468 -0.362103 0.268804 -0.458847 -0.532866 0.328448 0.509667 -0.520347 -0.547274 0.237569 -0.398532 -0.374181 -0.086018 0.190230 0.191396 -0.261262 -0.271919 -0.280507 -0.800245 -0.654744 -0.658399 -0.530466 -0.530389 0.299406 0.252364 0.247178 0.227874 0.233949 0.269665 0.259193 0.297701 0.263777 0.265025 0.282460 0.290086 0.231995 0.242285 0.269523 0.241147 0.220688 0.270160 0.226386 0.237252 0.260971 0.221518 0.254111 0.232172 0.231312 0.223825 0.255545
chargesum: 0.00000
title: Mulliken charges with hydrogens summed into heavy atoms:
elementType: S O O O O O N C C C C C C C C C C C C C C C C C C C C C C
charge: 0.883947 -0.298946 -0.299609 -0.301583 -0.562526 -0.560397 -0.126468 -0.062697 0.268804 0.040694 -0.071043 0.328448 0.509667 -0.250683 -0.288081 0.237569 -0.100831 -0.110404 -0.086018 0.190230 0.191396 0.003763 0.010542 0.009579 -0.056441 0.077251 0.066209 0.177335 0.180293
chargesum: 0.00396
polarizability: 3.51806732e+02 -1.74068873e+00 3.14253282e+02 2.39551256e+01 -2.04870153e+00 2.20195975e+02
1716.lowfreq: -200.4010 -8.2181 -5.2758 -1.0526 -0.0010 -0.0005 17.9218 18.8637 27.3471
frequency: -122.3584 18.3066 24.0886 32.4307 34.8637 51.9818 66.3673 71.0041 77.6317 84.0264 101.2297 108.3092 116.4677 133.3299 160.3255 168.9910 171.9276 172.4872 183.7943 184.3626 194.5622 197.1829 216.8420 226.6775 231.4722 241.2481 267.6251 271.2738 286.2880 288.5695 298.6420 314.3667 352.5658 356.2294 365.6243 381.7655 404.9991 411.3782 418.1708 433.4578 453.7716 465.4958 481.6800 490.7646 511.6705 555.0175 558.2555 575.1965 581.7175 614.1191 625.3011 640.9178 674.5483 698.2740 712.6810 731.5928 742.4056 766.5536 785.6384 811.7976 822.1957 866.0591 868.3556 871.9597 885.4043 900.9366 908.6038 913.3680 933.1020 937.9777 946.0341 947.0248 959.2903 977.2530 981.5272 994.3375 999.1151 1020.0422 1031.6978 1040.8385 1053.2702 1068.2357 1088.6606 1112.1060 1113.2661 1114.9606 1137.9532 1147.3090 1150.1947 1157.0592 1166.3069 1173.4317 1175.2316 1184.9632 1196.0449 1196.7050 1222.6623 1226.1358 1252.4510 1257.8473 1276.6934 1302.5328 1311.3302 1317.9577 1324.2248 1359.1791 1367.4426 1377.2781 1382.5393 1385.8501 1387.7473 1396.0477 1404.4196 1414.2873 1424.9162 1444.2598 1449.0683 1451.1071 1453.0778 1458.4810 1460.3087 1466.4721 1467.8264 1469.3543 1471.4549 1477.4885 1486.7058 1487.4481 1488.2476 1490.6020 1561.2368 1574.0372 1589.7009 1591.5658 1618.4214 2972.2871 2972.7362 2974.6320 2982.4207 2984.0759 2985.6581 2990.6610 3010.5189 3035.1698 3048.4232 3069.4469 3071.8778 3075.2928 3077.1283 3081.2067 3095.2290 3102.2551 3104.1151 3122.7556 3123.6088 3132.2564 3135.6684 3139.4868 3139.8465 3143.5117 3154.5038 3158.8239
redmass: 7.5270 4.4505 4.6478 3.8245 3.4678 4.3194 3.7564 3.9463 4.1131 4.0076 4.0805 3.0761 5.3259 4.9310 1.3363 1.1068 1.9801 1.8971 1.5155 2.3984 1.4095 3.6071 4.4515 4.8876 1.7444 2.2730 4.9238 4.5567 4.4684 4.3911 5.9833 4.2107 4.8852 3.0303 2.9961 3.9922 4.6025 2.9361 4.8941 3.8498 4.0716 3.7551 4.0092 4.0042 5.2192 5.3675 3.2420 4.2529 3.7739 6.1194 4.7498 5.7054 5.2234 4.9779 5.4515 3.8590 3.4714 2.7855 11.7758 4.0785 3.5128 1.2433 1.7342 2.6682 1.6275 2.0414 6.6740 2.2892 1.2036 2.8653 1.3839 3.6195 3.1891 2.1781 1.3859 1.8940 2.5146 2.1302 1.6723 1.3686 2.4814 2.2509 3.0599 1.3749 1.2596 1.2534 2.2124 1.4962 1.5672 1.6857 1.8517 2.8034 2.6108 1.1483 1.6010 2.0279 1.5732 1.2847 1.4638 1.6195 2.9241 1.4469 1.5583 1.5087 1.9243 1.4136 6.1354 1.2757 1.2192 5.9528 2.7997 1.1940 2.4596 2.6864 1.1779 1.3477 1.1163 1.1081 1.0441 1.0549 1.0617 1.0547 1.1516 1.8465 1.0728 1.0551 1.0555 1.4896 1.4721 1.2184 6.9859 6.6479 5.9272 7.2654 7.1866 1.0332 1.0617 1.0316 1.0358 1.0682 1.0360 1.0383 1.0826 1.0987 1.0874 1.1033 1.1040 1.0983 1.0984 1.0982 1.1008 1.1004 1.0926 1.1028 1.1029 1.0979 1.0880 1.0914 1.0892 1.0920 1.0958 1.0974
irintensity: 3.1154 1.1999 2.0208 0.7332 0.5722 3.2790 2.1894 7.2367 1.4430 0.4995 1.3033 3.8186 5.5761 2.5956 1.6468 0.0650 0.4978 0.3462 0.6578 4.4290 0.5743 6.1124 15.0028 16.0070 2.4610 5.2966 2.5769 14.2373 2.4651 3.4679 3.0964 5.1405 3.1256 5.2203 4.7534 12.6500 0.6125 1.3395 7.2757 9.2457 13.2166 2.5499 25.5794 5.7105 22.3336 41.3279 32.8231 17.5975 8.0201 0.1371 20.2413 16.8043 16.7038 9.4015 2.4701 5.9573 14.8269 2.3469 95.8406 1.0349 17.4329 3.1555 42.6120 1.3603 2.2123 12.6409 50.9900 59.1727 13.2351 34.4487 3.6783 15.6235 56.9851 6.5872 0.9187 1.1977 9.2645 31.7993 4.0653 36.0758 47.3736 7.4335 59.8116 6.4134 15.3727 0.8729 0.3157 7.9486 3.6351 5.1941 34.9187 22.0014 10.1121 1.9433 24.4300 29.1866 48.7032 21.8544 8.4458 77.3440 163.1860 15.8312 0.2300 27.5775 14.7507 6.8503 1.8685 29.2125 31.2159 3.6411 12.6963 25.8963 31.3915 149.0777 0.0790 12.4538 32.1679 27.7361 11.0444 13.2299 6.4881 18.7538 7.7863 17.2476 22.6897 5.4848 14.6832 26.0850 135.9221 35.9956 93.0223 110.3414 3.9636 1.9577 2.6607 85.7090 24.2727 66.2040 11.0178 24.9572 26.4580 7.6737 16.2235 27.1421 5.0754 31.7270 22.0784 11.4007 14.3942 11.0785 11.1807 15.2703 22.8884 21.9494 24.8060 7.6938 3.5792 8.6498 2.2474 0.6314 4.2751 2.4279
temp: 298.150 k
press: 1.00000 atm
elementType: 16 8 8 8 8 8 7 6 6 6 6 6 6 6 6 6 6 6 6 6 6 6 6 6 6 6 6 6 6 1 1 1 1 1 1 1 1 1 1 1 1 1 1 1 1 1 1 1 1 1 1 1 1 1 1 1
symmnumber: 1
zpe: 1171569.3 jmol-1
zpe.correction: 0.446227 hartree
zpe.thermalcorrener: 0.476106 hartree
zpe.thermalcorrenthalpy: 0.477050 hartree
zpe.thermalcorrgfe: 0.384370 hartree
zpe.sumelectzpe: -1681.141259 hartree
zpe.sumelectthermal: -1681.111380 hartree
zpe.sumelectthermalent: -1681.110435 hartree
zpe.sumelectthermalfe: -1681.203116 hartree
dipole: 5.8999 -3.2683 -0.1868
dipole: 6.7472
quadrupole: -187.9519 -161.0932 -191.3462
quadrupole: 18.6632 24.1445 17.3279
quadrupole: -7.8215 19.0372 -11.2157 18.6632 24.1445 17.3279
hfenergy: -1681.5874859 hartree
pointgroup: C01 [X(C22H27N1O5S1)]
dipole: 2.3315355 -1.2625145 -0.1294327 debye
polarizability: 352.868398|-1.4481666|314.2287922|20.9259295|-1.5995566|219.1587992 unknown
InChI: InChI=1S/C22H27NO5S/c1-14(2)29(25,26)18-8-6-16(7-9-18)22-19-13-21(28-5)20(27-4)12-17(19)10-11-23(22)15(3)24/h6-9,12-14,22H,10-11H2,1-5H3
charge 0 multiplicity 1
56 atoms
S  -4.907258 -0.420838 0.706911
O  3.081908 -3.063917 -1.321253
O  5.09646 -2.442489 0.720068
O  0.508365 3.721881 -1.959485
O  -4.879133 -1.01298 2.238675
O  -5.882615 0.827788 0.280591
N  1.134314 2.665612 0.011523
C  0.92074 1.332816 -0.621238
C  2.025015 0.349474 -0.228008
C  1.570475 2.635713 1.419049
C  2.960637 1.97441 1.517064
C  2.98843 0.643712 0.774462
C  -0.505165 0.833504 -0.308021
C  2.078974 -0.89812 -0.895929
C  4.001135 -0.30588 1.056184
C  0.908438 3.807249 -0.752353
C  -1.587755 1.352285 -1.069086
C  -0.768034 -0.06899 0.753802
C  -3.128488 0.067879 0.272948
C  3.073542 -1.847243 -0.599508
C  4.069536 -1.534454 0.373268
C  -5.362116 -1.941705 -0.512928
C  -2.916692 0.974494 -0.779739
C  -2.091799 -0.45673 1.059801
C  1.148508 5.164254 -0.094908
C  -6.882666 -2.072292 -0.449258
C  -4.560816 -3.150999 -0.042347
C  2.869994 -4.273423 -0.490787
C  6.038857 -2.759016 -0.380576
H  0.971734 1.525032 -1.709994
H  0.83217 2.057268 2.009916
H  1.591418 3.656361 1.828228
H  3.232404 1.826338 2.579538
H  3.716298 2.659998 1.083501
H  1.33391 -1.15727 -1.656246
H  4.766794 -0.097484 1.812114
H  -1.377002 2.068472 -1.871129
H  0.063581 -0.480167 1.336375
H  -5.015465 -1.534475 -1.479522
H  -3.765389 1.393458 -1.33081
H  -2.325375 -1.124466 1.896163
H  2.173826 5.262491 0.305036
H  0.437016 5.345678 0.731641
H  0.992242 5.934014 -0.864457
H  -7.207879 -2.43453 0.541842
H  -7.216722 -2.800736 -1.211938
H  -7.372972 -1.10411 -0.650502
H  -4.835161 -4.029586 -0.656288
H  -3.472282 -2.994137 -0.139365
H  -4.794291 -3.379118 1.012926
H  1.856648 -4.254703 -0.04652
H  3.62885 -4.342855 0.309216
H  2.959182 -5.123535 -1.183929
H  6.727488 -3.511642 0.032232
H  6.60142 -1.850856 -0.668362
H  5.502167 -3.161533 -1.258189
