program: Gaussian 09
title: 000209977
version: EM64L-G09RevD.01
frameworkgroup: C1[X(C14H21NO3)]
method: RPBEPBE
basis: SDD
operation: Freq
keyword: #p
keyword: freq=noraman
keyword: PBEPBE/SDD
title: #p freq=noraman PBEPBE/SDD
converged: YES YES NO NO
title: Mulliken charges:
elementType: O O O N C C C C C C C C C C C C C C H H H H H H H H H H H H H H H H H H H H H
charge: -0.283255 -0.263476 -0.248144 -0.095480 -0.380000 -0.275396 0.271191 0.125335 -0.497728 0.133279 -0.324510 -0.438515 -0.614562 -0.615122 0.339241 -0.384219 -0.693283 -0.534532 0.223345 0.200785 0.212376 0.229084 0.273232 0.282772 0.233418 0.233251 0.194525 0.228641 0.220320 0.192194 0.229683 0.223951 0.245494 0.227081 0.202383 0.227763 0.226427 0.225975 0.246473
chargesum: 0.00000
title: Mulliken charges with hydrogens summed into heavy atoms:
elementType: O O O N C C C C C C C C C C C C C C
charge: -0.283255 -0.263476 -0.248144 -0.095480 0.044130 0.166065 0.271191 0.125335 -0.224495 0.133279 -0.041739 0.028153 0.028924 0.030706 0.339241 -0.138725 -0.036054 0.164343
polarizability: 2.19291563e+02 1.69951960e+01 2.16691651e+02 -1.90406194e+00 5.63762578e-01 1.05839496e+02
1716.lowfreq: -6.2038 -0.0007 -0.0006 -0.0006 1.7231 4.4733 23.7165 36.1057 38.8198
frequency: 23.7027 35.8960 38.7468 49.7568 75.4750 92.9662 99.1886 125.6337 126.6269 134.3310 179.5078 187.4736 209.8759 218.7932 221.1745 227.9723 236.5266 253.0344 291.9364 305.9730 318.7339 348.0911 381.4341 407.3525 444.6383 451.1432 465.6202 548.4610 564.8936 572.7357 608.4866 629.0043 699.9665 719.9246 731.0791 790.5917 810.4064 820.2399 827.2051 857.0151 893.6588 949.1043 969.9966 985.3042 1012.5668 1026.0387 1035.2177 1036.4707 1062.0647 1068.4137 1080.2968 1089.4440 1093.1215 1112.4151 1123.5500 1138.6101 1145.4897 1163.1980 1172.5449 1214.9501 1238.9490 1239.1768 1249.9688 1269.5157 1272.9857 1294.4923 1327.4801 1344.2400 1373.3308 1391.4579 1392.8138 1412.5572 1421.9592 1424.1796 1435.9217 1444.8279 1461.5509 1465.8485 1468.1032 1469.3594 1470.0281 1473.2781 1476.6825 1476.9862 1481.9100 1486.7503 1488.9900 1553.6075 1570.5234 1620.5289 2858.2597 2867.3734 2891.1579 2967.8075 2975.2974 2986.8174 2993.3288 3023.5423 3027.7603 3029.3359 3036.4926 3059.0069 3059.1588 3081.3269 3085.0028 3087.2212 3096.7662 3129.3701 3146.5490 3172.5588 3183.3044
redmass: 4.4676 2.6274 3.8292 4.0259 3.8513 2.7767 2.2442 2.5714 3.0536 2.4887 2.5305 1.2451 3.0467 1.2043 1.2453 1.7279 3.7898 1.8448 4.1187 3.9851 4.0168 3.6268 2.9426 3.2921 2.9638 3.0251 3.8017 2.3713 7.0497 4.9561 4.8310 3.9725 4.7789 2.4125 4.7566 1.3867 1.7423 1.6159 2.0689 1.6436 6.1086 4.1217 7.9638 1.3207 2.9179 1.9233 1.5393 2.2170 1.6192 1.6717 2.9805 1.7627 1.6602 1.2580 1.8254 1.4237 1.6058 1.4081 1.7607 2.0257 2.2245 1.3969 1.7708 2.4894 1.7376 1.2368 1.3817 1.9589 2.9759 1.7490 1.2460 1.1857 1.2799 2.6823 1.2262 1.1587 1.0518 1.0404 1.0498 1.0900 1.1430 1.0772 1.0651 1.0545 1.3419 1.0554 1.5831 7.7424 7.1607 6.9191 1.0564 1.0579 1.0684 1.0325 1.0563 1.0581 1.0403 1.0735 1.0736 1.0966 1.0954 1.1033 1.1029 1.1009 1.1007 1.0997 1.0995 1.1002 1.0885 1.0947 1.0909
irintensity: 1.7696 1.2430 1.2995 0.5731 0.0193 5.4006 0.3164 3.4981 1.8141 4.0691 0.8249 0.7383 1.0630 1.8950 0.0585 1.8153 1.2901 4.2792 6.4446 0.7563 4.1491 8.7194 0.7375 6.6072 2.8305 3.4050 13.1767 1.6082 4.1267 23.5247 6.1555 4.8432 0.7344 2.5016 2.7325 29.7674 20.2451 10.1370 10.2991 37.2751 6.5933 48.4089 56.4688 1.4588 63.6561 22.3263 15.3558 77.4286 4.5042 0.2673 49.4688 21.1547 6.5793 0.2528 162.4968 3.9192 75.2399 13.5589 87.1184 104.1857 208.3048 69.1695 9.7368 8.9985 34.9515 2.8707 8.2349 83.3676 33.5169 8.8532 23.5347 36.1087 17.6173 58.3326 14.5193 3.6774 8.5287 9.8611 13.8046 16.8296 38.4526 46.7387 11.3164 11.4037 51.9627 9.2981 16.8589 40.1382 266.8115 307.9196 67.1369 154.9211 112.7070 70.7034 33.7972 34.6819 22.0983 36.7597 49.1826 5.6654 2.2994 1.4844 80.4786 28.1749 57.7719 29.8880 35.2684 22.3434 0.4151 14.7450 2.5223
temp: 298.150 k
press: 1.00000 atm
elementType: 8 8 8 7 6 6 6 6 6 6 6 6 6 6 6 6 6 6 1 1 1 1 1 1 1 1 1 1 1 1 1 1 1 1 1 1 1 1 1
symmnumber: 1
zpe: 853891.5 jmol-1
zpe.correction: 0.325230 hartree
zpe.thermalcorrener: 0.345470 hartree
zpe.thermalcorrenthalpy: 0.346414 hartree
zpe.thermalcorrgfe: 0.274865 hartree
zpe.sumelectzpe: -825.072412 hartree
zpe.sumelectthermal: -825.052172 hartree
zpe.sumelectthermalent: -825.051228 hartree
zpe.sumelectthermalfe: -825.122777 hartree
dipole: 1.8276 -4.3182 0.2197
dipole: 4.6942
quadrupole: -84.9740 -118.9916 -109.2519
quadrupole: 17.1350 1.2226 -2.2261
quadrupole: 19.4319 -14.5858 -4.8461 17.1350 1.2226 -2.2261
hfenergy: -825.3976422 hartree
pointgroup: C01 [X(C14H21N1O3)]
dipole: 1.0650572 1.5053073 -0.1025773 debye
polarizability: 208.7256132|-13.355176|221.5210511|20.5248738|-16.5103918|111.5760452 unknown
InChI: InChI=1S/C14H21NO3/c1-5-13(16)12-7-6-11(17-4)10-14(12)18-9-8-15(2)3/h6-7,10H,5,8-9H2,1-4H3
charge 0 multiplicity 1
39 atoms
O  0.514519 -0.37241 0.214659
O  -2.262401 3.457355 -0.719728
O  -2.889828 -2.904992 -0.203486
N  4.104765 0.489186 0.760317
C  2.875042 -0.332685 0.698071
C  1.665647 0.543947 0.341422
C  -0.742675 0.16401 -0.087555
C  -1.848879 -0.745272 -0.212969
C  -0.928287 1.552642 -0.265675
C  -1.813808 -2.243127 -0.056448
C  -3.115312 -0.177887 -0.518703
C  -0.512676 -2.974491 0.27419
C  4.699911 0.747698 -0.567491
C  5.102135 -0.023212 1.721661
C  -2.209338 2.068125 -0.568957
C  -3.322458 1.198909 -0.698571
C  -0.690052 -4.497487 0.388388
C  -3.564327 4.060979 -1.026254
H  2.695169 -0.786104 1.689212
H  2.950593 -1.17151 -0.036248
H  1.819286 1.079383 -0.616395
H  1.483152 1.284603 1.14297
H  -0.105626 2.264789 -0.174027
H  -3.947814 -0.883773 -0.611132
H  0.240005 -2.712126 -0.494984
H  -0.100059 -2.545492 1.208491
H  5.099697 -0.177899 -1.054148
H  5.530215 1.469071 -0.467243
H  3.952158 1.191892 -1.24707
H  5.524372 -1.020456 1.438972
H  4.646174 -0.113761 2.723118
H  5.942434 0.69054 1.795339
H  -4.321415 1.576044 -0.93185
H  -1.068371 -4.925648 -0.555859
H  0.274332 -4.979045 0.633588
H  -1.422667 -4.754292 1.17278
H  -4.296159 3.86333 -0.220026
H  -3.960894 3.689299 -1.99028
H  -3.368463 5.140768 -1.095477
