program: Gaussian 09
title: 000209969
version: EM64L-G09RevD.01
frameworkgroup: C1[X(C13H19N3O)]
method: RPBEPBE
basis: SDD
operation: Freq
keyword: #p
keyword: freq=noraman
keyword: PBEPBE/SDD
title: #p freq=noraman PBEPBE/SDD
converged: YES YES NO NO
title: Mulliken charges:
elementType: O N N N C C C C C C C C C C C C C H H H H H H H H H H H H H H H H H H H
charge: -0.302512 -0.426491 -0.155898 -0.667362 0.154058 -0.751828 -0.695950 -0.696090 0.189392 0.280453 -0.540092 0.401845 -0.408814 -0.382725 -0.228192 -0.234360 -0.244081 0.218523 0.234076 0.218548 0.253246 0.214658 0.212370 0.214607 0.212300 0.253364 0.364735 0.217456 0.215372 0.278112 0.220596 0.332822 0.382808 0.219959 0.221162 0.223932
chargesum: 0.00000
title: Mulliken charges with hydrogens summed into heavy atoms:
elementType: O N N N C C C C C C C C C C C C C
charge: -0.302512 -0.061756 -0.155898 0.048268 0.154058 -0.080680 -0.015676 -0.015819 0.189392 0.280453 -0.107264 0.401845 -0.130702 -0.162129 -0.008233 -0.013197 -0.020150
polarizability: 2.44481788e+02 -6.81067289e+00 1.66483913e+02 -4.82835320e-01 -4.54434975e-01 9.58022539e+01
1716.lowfreq: -11.8120 -6.3841 -0.0004 0.0002 0.0005 4.3827 8.3561 18.4952 36.1015
frequency: 5.1854 17.3088 36.0902 49.3337 88.8300 101.6466 150.2784 198.1496 199.0751 209.8681 228.6879 249.1956 263.0582 276.2102 303.6386 305.2621 316.6277 365.2637 367.6609 405.3117 445.4799 455.3981 460.2762 465.2964 552.4518 567.7968 616.0426 641.5342 657.0798 703.4743 707.6839 736.8083 747.1030 778.2263 796.5410 809.6549 857.4405 898.3476 905.0725 923.7294 926.4111 936.5208 951.0827 979.0461 983.1000 989.6546 999.1072 1006.4142 1020.3644 1024.9538 1027.9458 1075.4429 1142.2477 1167.0356 1170.5182 1177.2936 1205.6713 1207.6525 1222.2094 1234.1214 1260.3128 1296.1327 1339.4626 1368.2389 1372.2861 1388.2813 1391.8504 1400.4493 1436.6723 1447.0390 1455.9914 1457.1224 1470.9677 1472.5192 1479.3867 1482.5060 1494.4702 1500.0516 1542.5511 1594.7244 1616.4148 1616.5096 1668.3334 2867.8029 2903.7433 2967.3596 2979.4433 2982.1932 3060.0353 3072.9087 3073.3586 3079.3215 3097.8781 3102.2737 3102.9586 3121.5186 3135.2209 3155.0881 3170.5526 3351.6721 3541.9547 3659.7878
redmass: 3.0441 3.7027 5.2496 4.5053 3.9666 5.1784 4.1224 3.3951 5.4000 1.2341 1.9553 2.4607 1.2115 2.6400 1.0687 3.1166 3.1112 2.2850 3.4199 2.8556 1.3213 3.1703 4.8530 2.4529 4.7438 3.8943 6.2824 4.0232 3.2436 2.3766 2.3531 1.3526 1.9120 1.2224 3.6151 3.8574 1.2524 3.6313 1.3460 5.5869 1.6840 1.6415 1.2324 1.4669 1.5656 6.0637 2.8658 1.4211 1.4026 1.8645 1.6387 1.5418 2.1863 1.1133 1.8705 1.1494 2.9771 2.3451 1.0721 3.1425 2.4991 1.5106 1.4929 1.1801 1.2059 5.9276 2.8876 1.2080 1.9489 1.1824 2.2652 1.0518 1.0501 1.1303 1.1120 2.2961 1.0467 1.0706 2.5365 6.2360 1.7204 5.7643 6.3507 1.0553 1.1002 1.0367 1.0348 1.0357 1.1008 1.1003 1.0988 1.0982 1.1004 1.0995 1.0876 1.0862 1.0929 1.0981 1.0958 1.0616 1.0763 1.0902
irintensity: 0.0001 0.0905 0.4798 0.6580 4.2728 0.1233 3.8368 2.6808 1.9313 1.7371 3.5943 4.8445 0.0614 2.6150 0.4385 6.8476 3.0861 2.5296 21.3092 0.0508 135.8873 1.3847 0.2936 2.1919 9.7076 3.6486 0.0102 4.7547 2.3315 0.0256 84.1654 44.5182 138.2550 68.8099 0.4965 1.4618 0.3326 23.5968 0.4340 19.1237 3.5321 1.8884 0.6267 0.6622 2.7217 0.8016 28.0483 3.8703 0.6489 10.5194 9.6393 7.8654 2.3857 0.2194 57.1813 22.8334 4.3046 3.9967 0.1578 8.8825 18.1492 79.3596 80.4944 17.8537 40.9309 5.3411 188.1713 5.2220 45.2083 20.9913 215.0636 2.3793 4.0032 27.2660 6.6300 21.6314 13.7372 32.6164 374.1574 18.2379 85.8219 18.9918 641.9842 49.1215 40.3950 22.2446 34.9461 23.0895 21.5731 23.5688 3.9412 88.6280 2.4401 27.0449 14.8319 0.7604 37.1666 35.9775 12.2592 251.8533 37.4452 47.6821
temp: 298.150 k
press: 1.00000 atm
elementType: 8 7 7 7 6 6 6 6 6 6 6 6 6 6 6 6 6 1 1 1 1 1 1 1 1 1 1 1 1 1 1 1 1 1 1 1
symmnumber: 1
zpe: 791247.5 jmol-1
zpe.correction: 0.301370 hartree
zpe.thermalcorrener: 0.319127 hartree
zpe.thermalcorrenthalpy: 0.320071 hartree
zpe.thermalcorrgfe: 0.252517 hartree
zpe.sumelectzpe: -745.001397 hartree
zpe.sumelectthermal: -744.983640 hartree
zpe.sumelectthermalent: -744.982696 hartree
zpe.sumelectthermalfe: -745.050249 hartree
dipole: 1.2043 0.4206 0.0286
dipole: 1.2760
quadrupole: -100.0106 -91.8585 -107.3128
quadrupole: 13.4596 0.1597 -0.1451
quadrupole: -0.2833 7.8688 -7.5855 13.4596 0.1597 -0.1451
hfenergy: -745.3027669 hartree
pointgroup: C01 [X(C13H19N3O1)]
dipole: -0.471803 0.166694 -0.0403428 debye
polarizability: 239.4805968|1.2970004|158.3203601|26.5774028|22.9540747|108.9669976 unknown
InChI: InChI=1S/C13H19N3O/c1-13(2,3)11(17)16-12(14)15-9-10-7-5-4-6-8-10/h4-8,16H,9,14H2,1-3H3
charge 0 multiplicity 1
36 atoms
O  -3.461207 -1.695253 -1.086298
N  -1.809482 -0.245501 -0.301143
N  0.465862 -0.520583 0.014705
N  -0.871004 -2.360659 -0.856829
C  -4.177533 0.568917 -0.45547
C  -3.604983 1.898141 0.097122
C  -4.821352 0.813547 -1.851733
C  -5.255461 0.013768 0.520753
C  -3.118142 -0.547926 -0.638684
C  -0.651459 -1.083897 -0.379179
C  1.702841 -1.315297 -0.03786
C  2.912512 -0.530218 0.469842
C  2.784978 0.795344 0.945135
C  4.192829 -1.140143 0.470114
C  3.918059 1.500473 1.41371
C  5.325682 -0.43848 0.937375
C  5.19204 0.888108 1.412236
H  -2.852946 2.344365 -0.581768
H  -4.424639 2.631913 0.194661
H  -3.160433 1.776798 1.103802
H  -5.21199 -0.132198 -2.263083
H  -4.086031 1.226709 -2.566712
H  -5.654668 1.533832 -1.758793
H  -4.835933 -0.1525 1.530229
H  -6.08921 0.734395 0.607905
H  -5.651354 -0.945339 0.147052
H  -1.576364 0.684056 0.055227
H  1.920361 -1.654047 -1.0799
H  1.612755 -2.245966 0.573984
H  1.789872 1.248557 0.936153
H  4.306744 -2.169297 0.10318
H  -0.094186 -3.009286 -0.940374
H  -1.834776 -2.619686 -1.115421
H  3.805931 2.527843 1.779922
H  6.308951 -0.923026 0.931312
H  6.069941 1.434735 1.775227
