program: Gaussian 09
title: 000209868
version: EM64L-G09RevD.01
frameworkgroup: C1[X(C23H29N3)]
method: RPBEPBE
basis: SDD
operation: Freq
keyword: #pfreq=noraman
keyword: PBEPBE/SDD
title: #p freq=noraman PBEPBE/SDD
converged: YES YES NO NO
title: Mulliken charges:
elementType: N N N C C C C C C C C C C C C C C C C C C C C C C C H H H H H H H H H H H H H H H H H H H H H H H H H H H H H
charge: -0.081939 -0.219528 -0.025582 0.179770 0.105500 -0.485675 -0.471298 -0.373597 0.154633 0.224065 -0.333656 -0.467437 -0.376881 -0.424424 -0.573605 -0.370914 -0.350848 -0.253699 -0.240977 0.525623 -0.693935 -0.333400 -0.556601 -0.293184 0.155428 -0.771626 0.238322 0.202613 0.190687 0.235126 0.216407 0.189167 0.166413 0.203383 0.241942 0.245996 0.209057 0.203691 0.231258 0.243740 0.220965 0.226078 0.191607 0.193505 0.217956 0.217510 0.216022 0.209225 0.212400 0.241029 0.245293 0.235347 0.254457 0.226364 0.228225
chargesum: 0.00000
title: Mulliken charges with hydrogens summed into heavy atoms:
elementType: N N N C C C C C C C C C C C C C C C C C C C C C C C
charge: -0.081939 -0.219528 -0.025582 0.179770 0.105500 -0.044740 -0.045485 0.031977 0.154633 0.224065 0.036141 0.020500 0.035868 -0.193165 -0.108901 -0.144835 0.034264 -0.035743 -0.023467 0.525623 -0.056288 -0.092371 -0.311307 -0.057836 0.155428 -0.062580
polarizability: 3.62941595e+02 8.81537629e+00 3.07686623e+02 -2.27977472e+01 -8.91866807e-02 1.55872413e+02
1716.lowfreq: -4.9935 -3.3687 -0.0007 -0.0004 0.0012 6.0165 8.2904 13.8676 16.6118
frequency: 5.6680 13.7542 16.4741 21.5877 42.9836 47.0576 55.2706 66.8973 70.7196 90.0482 101.7736 135.8688 142.9130 169.8075 177.0924 206.8003 218.6036 236.5507 238.2709 262.7436 282.5899 301.9781 306.7686 334.1580 350.9933 370.4432 380.8978 393.9746 410.0736 430.9497 453.0278 494.2476 504.1891 521.2207 536.6110 571.4534 582.1929 604.2744 631.6380 635.6973 670.6695 701.1172 739.2605 741.9678 744.2486 753.0650 768.6995 774.6623 784.5281 799.2126 827.4940 830.7054 842.8200 850.3356 861.2066 897.9208 921.5077 930.1812 934.8135 964.1243 965.5175 970.6108 974.4227 976.3360 995.5745 1003.2370 1008.1760 1012.5727 1024.3391 1035.7227 1045.1571 1048.8929 1054.8856 1078.7672 1096.7939 1118.5778 1124.3825 1136.7365 1139.4465 1159.1980 1163.9872 1175.5168 1191.1115 1202.4202 1220.3571 1222.4273 1223.9663 1242.7488 1249.7443 1258.6499 1279.0103 1283.6124 1286.3352 1289.6988 1295.2534 1296.4080 1312.1594 1315.4393 1322.0121 1340.0327 1342.5913 1348.8523 1360.2278 1374.7612 1382.0090 1390.3097 1391.2686 1397.3404 1408.9447 1432.3055 1452.0300 1455.8140 1459.0548 1464.9250 1468.4022 1469.8135 1470.6332 1474.5919 1475.3336 1477.6990 1479.2968 1481.9118 1483.0939 1489.3034 1489.7819 1554.4747 1578.9130 1595.3165 1602.3534 1627.2850 2798.9333 2816.0279 2847.8720 2963.1664 2964.6836 2973.1670 2977.4830 2983.0283 2995.5891 3001.0074 3006.4328 3007.0139 3008.3706 3013.7393 3036.4193 3045.6598 3047.5939 3060.4671 3070.5189 3072.3109 3074.3977 3102.8767 3116.9661 3118.1968 3119.2432 3126.4042 3140.7768 3148.8419 3159.6998
redmass: 1.1202 3.5561 4.1654 4.1910 3.6237 3.1533 2.8577 2.1126 3.9153 3.4437 2.8764 3.0357 2.9382 3.0533 3.5728 3.4575 1.8687 2.5564 1.2950 3.0099 2.7852 3.0541 2.9631 4.2428 2.3584 3.7062 2.7842 4.2226 3.2646 2.8997 3.0458 3.7801 4.7055 3.7656 3.7960 3.9931 3.8199 4.8106 4.7975 7.4957 4.3855 4.5784 1.0888 2.1022 1.7592 3.9461 1.6253 2.9972 2.2207 1.1966 3.2964 2.7372 1.4508 2.0206 2.3679 1.7344 1.3800 1.4740 1.2682 1.5552 1.9863 1.7823 2.0373 1.4595 1.9701 3.2867 3.3260 2.1542 3.2663 2.0434 2.4843 1.5885 2.1733 2.3042 2.5012 1.9479 1.8634 2.2697 1.3284 1.2834 1.6480 1.3952 1.2616 2.1622 1.9360 1.7839 1.3792 1.6687 2.2840 1.3893 1.2919 1.2776 1.4002 1.1446 1.4453 1.5734 6.0305 1.4476 1.4448 1.4724 1.5743 1.5159 1.6834 1.9789 1.7335 1.2743 1.2578 1.6260 4.7632 3.2983 1.1908 1.2325 1.0993 2.4710 1.0790 1.0996 1.0471 1.1645 1.1719 1.0447 1.9389 1.7721 1.7578 1.1220 1.1044 5.1877 6.6544 6.3346 7.8450 7.4617 1.0721 1.0703 1.0708 1.0586 1.0587 1.0373 1.0599 1.0383 1.0596 1.0865 1.0925 1.0611 1.0900 1.1002 1.0893 1.1032 1.1010 1.0973 1.1008 1.0994 1.1048 1.0912 1.0962 1.0908 1.0848 1.0887 1.0948 1.0969 1.1000
irintensity: 0.9214 0.6934 0.7261 0.4175 0.0571 0.0890 0.1929 0.0581 0.0984 0.4587 0.1556 0.7805 0.4140 0.7954 1.3585 6.8625 0.5944 1.0304 0.4851 0.6191 1.3163 2.3855 4.0465 0.0274 3.2865 0.8802 4.3149 2.6960 3.9087 5.7362 1.1333 10.1199 0.8521 8.0230 0.5878 3.5060 0.4101 7.2323 2.4130 1.1220 6.9562 3.3989 8.7562 27.0808 74.9574 0.0921 4.9166 2.9176 4.6105 0.7374 5.4410 13.3030 0.3323 12.1604 0.8532 11.6292 1.2362 0.6948 4.4049 2.6342 5.7268 2.5254 6.0349 3.4425 0.6220 8.9210 12.0937 8.2899 6.7759 0.5433 5.5351 9.8109 8.9944 0.4647 11.2066 4.0111 31.7044 42.4411 7.6215 4.0026 15.6640 23.7722 1.4704 7.9887 6.2175 5.9251 2.6210 19.9659 1.4530 1.2075 1.8386 0.2360 7.2934 0.5653 2.2919 5.4265 3.4079 9.4977 5.6642 15.4768 89.0650 45.4281 24.8077 9.3362 4.0103 18.1382 20.3197 9.7889 34.5826 72.9835 1.3296 30.6895 3.6897 23.6344 0.1088 1.2433 14.7667 1.8734 28.8731 10.8720 31.5296 50.8173 8.8794 21.9509 26.2273 9.8868 0.0811 10.2962 4.5310 12.9572 55.4302 106.5794 144.5205 23.9459 57.1354 33.6257 35.2336 25.8018 3.2656 29.8150 14.8490 53.8092 24.8845 29.9556 50.0024 45.1211 1.4353 20.5105 89.4324 57.4155 16.6045 29.5604 17.4487 12.4647 3.2593 5.1449 44.4386 14.7108 35.2813
temp: 298.150 k
press: 1.00000 atm
elementType: 7 7 7 6 6 6 6 6 6 6 6 6 6 6 6 6 6 6 6 6 6 6 6 6 6 6 1 1 1 1 1 1 1 1 1 1 1 1 1 1 1 1 1 1 1 1 1 1 1 1 1 1 1 1 1
symmnumber: 1
zpe: 1229597.0 jmol-1
zpe.correction: 0.468329 hartree
zpe.thermalcorrener: 0.493583 hartree
zpe.thermalcorrenthalpy: 0.494527 hartree
zpe.thermalcorrgfe: 0.407258 hartree
zpe.sumelectzpe: -1056.188178 hartree
zpe.sumelectthermal: -1056.162924 hartree
zpe.sumelectthermalent: -1056.161980 hartree
zpe.sumelectthermalfe: -1056.249249 hartree
dipole: -0.7495 -0.0779 -0.1936
dipole: 0.7780
quadrupole: -138.8484 -158.4406 -161.7415
quadrupole: -15.2045 -8.9868 -0.0668
quadrupole: 14.1617 -5.4304 -8.7313 -15.2045 -8.9868 -0.0668
hfenergy: -1056.6565072 hartree
pointgroup: C01 [X(C23H29N3)]
dipole: 0.2959846 -0.0212995 0.0750093 debye
polarizability: 363.3652903|-6.4973383|307.1202912|-23.471249|1.5243896|156.0150492 unknown
InChI: InChI=1S/C23H29N3/c1-3-4-13-25-14-12-23-21(17-25)20-7-5-6-8-22(20)26(23)15-11-19-10-9-18(2)24-16-19/h5-10,16H,3-4,11-15,17H2,1-2H3
charge 0 multiplicity 1
55 atoms
N  -3.354446 -1.446129 -0.005282
N  0.283221 0.618076 -0.346873
N  5.557498 -2.198025 0.170958
C  -0.841322 -0.207743 -0.131507
C  -1.950753 0.575745 0.167175
C  -0.871606 -1.705396 -0.22664
C  -3.316256 -0.014012 0.407364
C  -2.164854 -2.199231 0.469345
C  -1.521101 1.957789 0.157974
C  -0.112829 1.954488 -0.160312
C  -4.622296 -2.111575 0.385025
C  1.654621 0.16894 -0.592949
C  -5.871432 -1.509183 -0.290852
C  -2.173102 3.199103 0.377477
C  2.502049 0.061221 0.714119
C  0.638256 3.146032 -0.25405
C  -7.139321 -2.35344 -0.026292
C  -1.426933 4.391392 0.282124
C  -0.036232 4.365551 -0.029928
C  3.925545 -0.370525 0.421288
C  -8.408862 -1.73406 -0.649591
C  4.929829 0.557534 0.04026
C  4.308959 -1.734104 0.469022
C  6.225892 0.099706 -0.269391
C  6.515123 -1.29031 -0.200305
C  7.891668 -1.833836 -0.523726
H  -0.877189 -2.034195 -1.285106
H  0.006907 -2.174234 0.261719
H  -3.600896 0.096631 1.489548
H  -4.075754 0.539372 -0.176001
H  -2.321911 -3.268082 0.235865
H  -2.034117 -2.113509 1.579537
H  -4.769072 -2.095728 1.499154
H  -4.542726 -3.175798 0.087049
H  2.144963 0.872306 -1.291504
H  1.62773 -0.814224 -1.094957
H  -5.683662 -1.438623 -1.380385
H  -6.050407 -0.47823 0.073547
H  -3.241845 3.232885 0.618656
H  2.488082 1.04416 1.220785
H  2.010001 -0.661129 1.392137
H  1.706707 3.138391 -0.498115
H  -7.283141 -2.467902 1.068059
H  -6.989805 -3.375776 -0.42978
H  -1.918941 5.356104 0.449973
H  0.517874 5.308599 -0.097778
H  -9.301506 -2.355599 -0.452002
H  -8.600786 -0.725505 -0.236995
H  -8.302742 -1.632441 -1.746052
H  4.698914 1.629408 -0.000898
H  3.580963 -2.499943 0.769527
H  7.013908 0.803274 -0.558921
H  7.883109 -2.930758 -0.431752
H  8.200768 -1.564679 -1.551048
H  8.655959 -1.427381 0.165106
