program: Gaussian 09
title: 000209805
version: EM64L-G09RevD.01
frameworkgroup: C1[X(C5H5NO2S)]
method: RPBEPBE
basis: SDD
operation: Freq
keyword: #p
keyword: freq=noraman
keyword: PBEPBE/SDD
title: #p freq=noraman PBEPBE/SDD
converged: NO NO NO NO
title: Mulliken charges:
elementType: S O O N C C C C C H H H H H
charge: 0.350745 -0.432938 -0.236881 -0.022926 0.366566 -0.414976 -0.727268 -0.451993 0.164071 0.249368 0.249348 0.244505 0.274146 0.388234
chargesum: 0.00000
title: Mulliken charges with hydrogens summed into heavy atoms:
elementType: S O O N C C C C C
charge: 0.350745 -0.044703 -0.236881 -0.022926 0.366566 -0.414976 0.015953 -0.177848 0.164071
polarizability: 1.07783950e+02 6.04356417e-01 9.78298559e+01 4.24787498e-03 8.60094877e-03 3.74831023e+01
1716.lowfreq: -29.4974 0.0003 0.0013 0.0025 9.6454 9.7259 13.5724 77.0839 147.6631
frequency: -28.7393 77.0538 147.6613 168.4641 239.3187 298.5611 385.7083 445.5779 464.9871 540.9529 581.1735 624.0591 647.0602 656.5494 723.1403 768.1246 784.5834 911.6087 987.8773 1019.6344 1042.8315 1134.0948 1225.8119 1288.7553 1331.5340 1393.6069 1407.9145 1454.0553 1455.5436 1510.2975 1627.6251 3002.9390 3082.8455 3125.6449 3219.6982 3526.8810
redmass: 1.0357 8.1621 6.0033 6.1692 4.0558 4.0399 8.4041 7.5200 3.6453 6.0353 1.2856 5.7613 4.8453 6.5981 6.2807 6.0813 1.3189 3.0485 7.4875 2.1491 1.5280 1.8221 1.3664 2.8300 4.5007 2.1455 2.2075 1.0441 1.1101 8.6123 8.2579 1.0367 1.0962 1.1011 1.0955 1.0644
irintensity: 0.2569 1.1170 0.1071 0.3580 12.0094 6.4241 2.1208 2.7593 3.3224 24.3941 133.4109 29.6693 13.1531 7.3657 10.9091 6.6810 46.4865 46.6197 194.9445 26.5596 8.4571 132.5330 2.0183 15.6419 64.7193 84.2439 6.4543 16.8908 18.7930 131.0718 256.9382 5.2038 7.5154 11.0181 0.3128 45.0042
temp: 298.150 k
press: 1.00000 atm
elementType: 16 8 8 7 6 6 6 6 6 1 1 1 1 1
symmnumber: 1
zpe: 247041.9 jmol-1
zpe.correction: 0.094093 hartree
zpe.thermalcorrener: 0.102034 hartree
zpe.thermalcorrenthalpy: 0.102979 hartree
zpe.thermalcorrgfe: 0.060871 hartree
zpe.sumelectzpe: -796.127467 hartree
zpe.sumelectthermal: -796.119526 hartree
zpe.sumelectthermalent: -796.118582 hartree
zpe.sumelectthermalfe: -796.160689 hartree
dipole: -0.1400 -1.3228 -0.0002
dipole: 1.3302
quadrupole: -55.4594 -58.7552 -59.8256
quadrupole: -0.5457 0.0002 -0.0001
quadrupole: 2.5540 -0.7418 -1.8122 -0.5457 0.0002 -0.0001
hfenergy: -796.2215602 hartree
pointgroup: C01 [X(C5H5N1O2S1)]
dipole: -0.0395703 0.5218247 -0.0000962 debye
dipolederiv: -0.1317051 0.1972862 -0.0000179 0.2264938 -0.2866456 0.0000547 0.0000183 0.0000172 0.1858161 -0.7806945 0.4759937 -0.0000856 0.6218203 -0.8376012 0.0000642 -0.0001167 0.000077 -0.4283319 -0.8855911 -0.2870613 0.0000638 -0.2440958 -0.8327419 0.0001051 0.0000231 0.0000961 -0.3133992 -0.3920647 -0.1384298 0.0000243 0.0835663 -0.8328196 0.0000837 -0.0000214 0.0001525 -0.1857181 0.3459631 0.2283213 -0.0000257 -0.1941172 0.5203197 -0.0000532 -0.0000154 -0.0000001 0.0750782 -0.8762131 0.148726 0.0000154 0.172362 0.1337091 -0.0000141 -0.0000299 -0.0000539 -0.1821846 0.1244645 -0.1262796 0.0000385 -0.0025372 -0.2175172 0.0000177 0.0001305 -0.0001208 0.0346679 0.3208601 -0.3543345 -0.0000024 -0.3497223 0.5611645 -0.0000893 0.0000745 -0.0000889 -0.1609449 1.9829791 -0.0959925 -0.000003 -0.1848896 1.294973 -0.0001947 0.0000257 -0.0001813 0.2798128 0.0537091 -0.0184687 0.0923837 0.0091001 0.0560456 0.0135176 0.0709611 0.0485658 -0.0084571 0.0538729 -0.0184732 -0.0922945 0.0090765 0.0559508 -0.0135843 -0.0709378 -0.048598 -0.0086492 -0.0577966 0.1291427 -0.0001345 0.0357595 0.0528923 0.0000428 -0.0001135 0.0000998 0.1242608 0.0272915 -0.0466066 0.0000208 -0.0021014 0.0606705 0.0000223 -0.000037 0.0000097 0.1863989 0.2149247 -0.0938238 0.0000173 -0.1807151 0.2716 0.0000276 0.0000385 0.000025 0.4016503 unknown
polarizability: 107.2467747|2.328901|98.3670308|-0.002629|-0.0092254|37.4831023 unknown
InChI: InChI=1S/C5H5NO2S/c1-3-4(5(7)8)9-2-6-3/h2,7H,1H3
charge 0 multiplicity 1
14 atoms
S  0.533054 1.903045 -0.000326
O  -2.344864 1.183515 -0.000281
O  -2.160856 -1.142801 0.000146
N  2.150739 -0.220951 -0.000053
C  0.846259 -0.741555 0.000068
C  -0.165101 0.234586 -0.000113
C  0.651287 -2.232408 0.000334
C  2.156353 1.105791 -0.000388
C  -1.605978 -0.014248 -0.000052
H  0.071719 -2.559328 0.881118
H  0.072726 -2.559756 -0.880967
H  1.636965 -2.722685 0.000968
H  3.062926 1.711328 -0.000518
H  -3.315426 0.963963 -0.000237
