program: Gaussian 09
title: 000209871
version: EM64L-G09RevD.01
frameworkgroup: C1[X(C24H31N3)]
method: RPBEPBE
basis: SDD
operation: Freq
keyword: #pfreq=noraman
keyword: PBEPBE/SDD
title: #p freq=noraman PBEPBE/SDD
converged: YES YES NO NO
title: Mulliken charges:
elementType: N N N C C C C C C C C C C C C C C C C C C C C C C C C H H H H H H H H H H H H H H H H H H H H H H H H H H H H H H H
charge: -0.096497 -0.214319 -0.024235 0.183335 0.087752 -0.473041 -0.487651 -0.368784 0.159544 0.218524 -0.326952 -0.465439 -0.073978 -0.624801 -0.371460 -0.573584 0.462176 -0.695236 -0.704999 -0.369187 0.526354 -0.830043 -0.335031 -0.556618 -0.294813 0.155567 -0.771817 0.194382 0.230705 0.236311 0.198477 0.215262 0.188250 0.175206 0.196397 0.247008 0.239273 0.211925 0.236102 0.229346 0.240196 0.223905 0.193726 0.204609 0.248215 0.202883 0.216790 0.211016 0.223459 0.224620 0.225388 0.221196 0.239119 0.247729 0.234757 0.254996 0.227325 0.226662
chargesum: 0.00000
title: Mulliken charges with hydrogens summed into heavy atoms:
elementType: N N N C C C C C C C C C C C C C C C C C C C C C C C C
charge: -0.096497 -0.214319 -0.024235 0.183335 0.087752 -0.047955 -0.052863 0.034728 0.159544 0.218524 0.044650 0.020843 0.137947 -0.388699 -0.142115 -0.109483 0.462176 -0.048686 -0.074311 -0.145729 0.526354 -0.158839 -0.095912 -0.308888 -0.060056 0.155567 -0.062835
polarizability: 3.65870515e+02 1.49740803e+01 3.35713688e+02 -2.18615972e+01 -1.46967041e-02 1.68444425e+02
1716.lowfreq: -5.6173 -0.0010 -0.0003 0.0007 2.8463 5.7737 13.8757 16.8526 17.4134
frequency: 13.7312 16.8326 17.2694 32.8558 34.4701 43.6190 50.4317 63.3827 68.1797 71.3402 94.3347 113.5248 126.1365 164.7878 176.3926 179.1135 195.7856 216.7960 229.3213 233.5386 263.0676 273.9493 288.3138 306.3713 315.1511 332.8817 348.3233 365.9583 369.6150 378.5946 389.5280 409.3277 412.2595 432.5281 446.5347 483.9786 496.1614 520.0580 539.9377 569.9763 581.3937 601.8522 635.4242 639.3582 667.6316 704.5468 742.9333 744.9125 755.3850 774.8940 780.8010 788.6638 794.4197 818.4734 827.4328 848.7723 851.9341 878.7801 892.6175 899.6065 920.6231 929.8399 932.0946 943.1320 960.4461 971.9707 973.1485 974.6349 987.6127 995.9618 1004.3536 1007.7914 1014.2133 1030.4898 1040.7873 1046.1928 1049.1119 1052.3648 1101.6061 1121.3523 1135.3890 1138.5639 1146.3718 1162.7505 1173.6543 1178.1596 1188.4053 1191.8787 1213.9913 1221.7029 1226.3655 1240.4456 1248.4774 1255.6563 1279.3101 1284.7352 1289.4238 1296.9486 1305.1403 1311.5654 1312.3257 1314.0095 1335.3080 1338.5384 1345.6320 1362.0878 1371.2149 1374.3742 1374.8419 1384.3112 1390.4000 1396.4456 1397.0850 1404.3247 1430.9501 1449.8848 1455.6029 1455.9506 1463.6824 1464.1310 1467.5972 1470.6800 1470.9285 1473.4735 1473.5715 1476.7303 1477.6074 1480.7382 1482.1186 1488.0064 1490.5174 1495.0755 1554.3831 1579.1579 1595.1083 1602.5015 1633.3273 2802.5795 2822.5744 2848.4402 2961.1208 2965.9203 2969.4545 2969.9175 2970.5382 2982.9512 2994.6008 2997.0600 3003.6262 3006.9274 3010.1823 3036.5159 3045.8087 3046.9886 3056.6020 3060.5642 3063.6196 3071.1557 3072.7782 3077.5252 3086.4565 3104.8651 3114.6248 3116.3914 3117.4355 3121.7157 3139.9410 3148.0959
redmass: 4.3112 4.3746 4.0232 2.6676 1.1165 3.4216 3.5817 1.7924 1.5583 3.4557 3.0608 3.2062 3.6470 3.4256 2.9227 2.8339 1.0744 1.7859 1.4557 2.1535 2.7864 2.9895 2.6766 3.1488 2.7905 2.9648 3.6310 2.5788 2.8285 2.8089 4.2003 3.2079 2.4109 2.8459 2.5036 4.1987 3.7443 3.6193 3.7370 4.1979 3.6476 3.6937 7.6184 5.0564 4.8417 4.9673 3.5175 2.6767 3.8575 3.1779 2.3834 1.7298 1.4167 2.7293 3.0833 2.2247 2.4343 1.3986 1.9410 1.7004 1.2039 1.3294 1.4769 1.6838 1.5624 1.6244 1.7476 1.4927 1.8157 1.7893 3.4440 3.2642 1.9457 3.2575 1.9444 1.5252 1.5880 2.1348 2.3993 2.4610 1.5665 1.5919 1.6574 1.7715 1.3588 1.8393 1.9778 1.3638 1.9213 2.9410 1.8119 1.5614 2.2554 1.4603 1.4975 1.3575 1.3934 1.5704 1.3717 2.2114 2.7845 1.5328 1.5255 1.4115 1.5081 1.5745 1.3759 1.7358 1.9386 1.4920 1.2581 1.2862 1.2572 5.1789 3.4001 1.1893 1.1006 1.2197 1.2406 1.3499 1.0887 1.0466 1.0462 1.2646 1.2225 1.5321 1.1154 1.2493 2.2626 1.1641 1.0720 1.7785 5.1849 6.5677 6.3811 7.8157 7.2632 1.0720 1.0697 1.0708 1.0586 1.0362 1.0699 1.0375 1.0473 1.0382 1.0602 1.0844 1.0883 1.0603 1.1001 1.0890 1.0977 1.1013 1.0991 1.0973 1.0987 1.0989 1.1051 1.0983 1.0992 1.0913 1.0868 1.0925 1.0946 1.0914 1.0967 1.0969
irintensity: 0.7915 0.6016 0.1551 0.1364 0.4638 0.1055 0.2363 0.5466 0.2722 0.0418 0.6092 0.5570 0.1051 1.2759 1.2174 5.3930 0.1255 0.6846 0.5945 0.4345 1.1262 2.6451 2.3253 3.8035 0.5477 1.7033 0.4135 1.9632 0.2739 4.0897 5.4779 2.3948 2.1794 5.4029 1.8423 1.9320 11.3009 7.7421 0.4796 1.6985 4.4432 4.7273 1.0886 0.6501 9.0370 4.5224 2.1405 9.1543 2.8358 9.1217 4.1465 5.2300 42.6868 1.2947 6.9860 13.1865 4.9921 6.8933 0.7985 9.0148 6.1534 0.4186 1.2348 0.9394 1.7660 8.4324 6.0900 1.8790 4.4238 1.8068 8.5083 13.8658 16.0148 4.5121 1.5835 10.3728 9.7091 17.9371 15.1393 67.0777 2.0096 6.4704 10.5584 18.9156 22.2228 4.7160 1.8279 0.4796 13.2941 3.3929 3.7652 11.6069 4.8174 3.7896 5.1604 4.3906 3.2478 4.0495 0.4928 13.8678 0.0872 10.2827 4.1076 26.3806 105.3828 9.2434 20.3811 34.1927 3.8882 12.1841 20.4787 10.7626 6.0108 40.7178 76.6304 1.3905 8.8332 28.4928 8.5081 5.1759 1.6367 14.8459 11.5734 7.1905 15.7420 62.4278 3.6207 23.7871 49.0956 18.3503 22.4805 25.9844 9.3273 2.4827 10.6333 9.6274 11.2990 59.4579 91.1714 158.5915 63.1914 42.4040 1.5345 67.5063 41.4119 26.1373 4.5537 26.1022 35.8578 58.1081 34.4173 60.3003 25.0640 0.4698 17.0134 20.7133 68.6634 55.4316 18.3351 20.6753 33.4931 28.9912 9.8683 22.8059 5.4598 25.5295 24.7152 16.0275
temp: 298.150 k
press: 1.00000 atm
elementType: 7 7 7 6 6 6 6 6 6 6 6 6 6 6 6 6 6 6 6 6 6 6 6 6 6 6 6 1 1 1 1 1 1 1 1 1 1 1 1 1 1 1 1 1 1 1 1 1 1 1 1 1 1 1 1 1 1 1
symmnumber: 1
zpe: 1299027.6 jmol-1
zpe.correction: 0.494773 hartree
zpe.thermalcorrener: 0.521867 hartree
zpe.thermalcorrenthalpy: 0.522811 hartree
zpe.thermalcorrgfe: 0.432920 hartree
zpe.sumelectzpe: -1095.418439 hartree
zpe.sumelectthermal: -1095.391346 hartree
zpe.sumelectthermalent: -1095.390401 hartree
zpe.sumelectthermalfe: -1095.480292 hartree
dipole: 0.2297 -3.3394 -0.8677
dipole: 3.4579
quadrupole: -164.3318 -150.4440 -168.4635
quadrupole: 12.0642 -5.0938 1.0531
quadrupole: -3.2521 10.6358 -7.3837 12.0642 -5.0938 1.0531
hfenergy: -1095.9132124 hartree
pointgroup: C01 [X(C24H31N3)]
dipole: -0.0298345 -1.3247728 0.3080088 debye
polarizability: 367.0820701|-12.9768727|334.3572994|-22.5665886|3.2446521|168.5892583 unknown
InChI: InChI=1S/C24H31N3/c1-17(2)15-26-11-10-24-22(16-26)21-13-18(3)5-8-23(21)27(24)12-9-20-7-6-19(4)25-14-20/h5-8,13-14,17H,9-12,15-16H2,1-4H3
charge 0 multiplicity 1
58 atoms
N  -3.322188 -1.838445 0.116547
N  0.222592 0.361733 -0.341274
N  6.200808 0.260531 -0.093011
C  -0.865649 -0.499871 -0.089342
C  -2.006387 0.249318 0.181773
C  -3.345545 -0.38653 0.451221
C  -0.834627 -2.000638 -0.119107
C  -2.098537 -2.514854 0.615512
C  -1.633588 1.646396 0.118319
C  -0.229872 1.687328 -0.204585
C  -4.565457 -2.530706 0.532282
C  1.610397 -0.037707 -0.578112
C  -5.825021 -2.109017 -0.268659
C  -2.336963 2.867225 0.295921
C  0.463331 2.908662 -0.343753
C  2.466204 -0.066533 0.727919
C  -1.660532 4.098689 0.158997
C  -5.634493 -2.358379 -1.78107
C  -7.061111 -2.860394 0.278266
C  -0.26492 4.101251 -0.159834
C  3.90462 -0.451421 0.442745
C  -2.39057 5.419733 0.346212
C  4.316609 -1.805508 0.335881
C  4.900311 0.532448 0.219235
C  5.655427 -2.107985 0.017301
C  6.581987 -1.051869 -0.198633
C  8.030771 -1.323593 -0.548203
H  -3.640432 -0.232023 1.524854
H  -4.126864 0.102962 -0.161107
H  -0.838951 -2.377612 -1.161552
H  0.067768 -2.410769 0.37907
H  -2.21106 -3.59987 0.438505
H  -1.959628 -2.366331 1.717951
H  -4.769937 -2.379898 1.626403
H  -4.413145 -3.618085 0.37875
H  2.070308 0.662466 -1.299862
H  1.622518 -1.036804 -1.048998
H  -5.996963 -1.023872 -0.113495
H  -3.40609 2.858917 0.541342
H  1.530341 2.943582 -0.591455
H  2.418501 0.933213 1.19773
H  2.002183 -0.780287 1.434706
H  -5.544128 -3.443298 -1.98646
H  -6.494608 -1.973815 -2.360202
H  -4.712246 -1.870232 -2.1409
H  -6.941637 -3.954578 0.155256
H  -7.976229 -2.560389 -0.264475
H  -7.22023 -2.654359 1.353937
H  0.250677 5.064086 -0.264392
H  -1.946114 6.015436 1.166434
H  -2.343651 6.041544 -0.568274
H  -3.45602 5.261026 0.587788
H  3.595857 -2.614029 0.511337
H  4.647953 1.598278 0.302065
H  5.990735 -3.147729 -0.0628
H  8.563744 -0.368105 -0.669384
H  8.5322 -1.911509 0.243336
H  8.116648 -1.900081 -1.488358
