program: Gaussian 09
title: 000209816
version: EM64L-G09RevD.01
frameworkgroup: C1[X(C15H16N2O4S)]
method: RPBEPBE
basis: SDD
operation: Freq
keyword: #p
keyword: freq=noraman
keyword: PBEPBE/SDD
title: #p freq=noraman PBEPBE/SDD
converged: YES YES NO NO
title: Mulliken charges:
elementType: S O O O O N N C C C C C C C C C C C C C C C H H H H H H H H H H H H H H H H
charge: 0.163481 -0.165741 -0.413788 -0.199737 -0.274033 -0.079571 -0.390156 -0.469450 -0.116893 -0.179558 -0.138664 0.103197 -0.672267 -0.673895 0.176309 0.185604 0.254936 -0.345600 -0.356346 -0.222924 -0.238336 -0.225221 0.331733 0.303148 0.311686 0.250618 0.233113 0.231639 0.234215 0.260492 0.222010 0.320000 0.387122 0.275302 0.219968 0.233885 0.230375 0.233347
chargesum: 0.00000
title: Mulliken charges with hydrogens summed into heavy atoms:
elementType: S O O O O N N C C C C C C C C C C C C C C C
charge: 0.163481 -0.165741 -0.026666 -0.199737 -0.274033 -0.079571 -0.070156 -0.137716 -0.116893 0.123590 0.173022 0.103197 0.043102 0.042822 0.176309 0.185604 0.254936 -0.070298 -0.136378 0.010961 -0.007961 0.008126
polarizability: 2.81206655e+02 2.92133323e+00 1.92260506e+02 -1.07323863e+00 1.46362359e+00 1.39791034e+02
1716.lowfreq: -7.1713 -4.9856 -0.0013 0.0013 0.0019 6.7503 23.3259 27.9401 34.2067
frequency: 22.8918 27.8648 34.1446 52.2493 63.0794 69.1852 93.0890 107.6655 134.4484 151.1111 159.9055 207.6032 215.2334 246.1646 254.7855 272.1648 274.3830 290.8857 306.8838 335.4224 351.6163 379.9584 400.7332 406.6609 430.8752 472.2554 476.2942 490.5343 526.4249 556.3478 581.6951 611.8721 615.5132 617.7867 638.1370 660.9270 685.0994 688.8452 702.0613 719.6897 762.4586 793.5328 813.3438 848.7509 856.2000 865.1751 897.5708 931.5078 937.0340 942.8517 949.1017 981.8203 985.5979 989.5692 1007.0951 1010.9156 1024.4749 1034.5164 1068.9181 1076.2256 1092.0097 1115.3242 1159.7741 1173.3305 1174.2606 1184.2884 1192.5495 1197.8298 1206.8421 1230.2859 1242.5880 1253.0902 1267.6698 1280.2804 1320.0603 1323.6941 1357.4160 1385.8135 1386.6166 1403.6153 1433.7742 1456.4648 1464.8485 1468.7572 1474.5811 1483.9602 1492.5498 1574.5546 1607.5869 1611.8070 1667.8105 1727.8977 2979.2356 2987.8609 3049.8308 3066.3818 3074.9274 3084.7968 3098.3112 3101.6584 3116.7785 3126.4283 3132.5806 3146.1513 3159.0950 3170.7380 3507.1148 3526.3951
redmass: 4.4812 6.7797 5.2191 6.6591 10.0961 6.3568 6.9090 8.3078 5.7853 5.6863 5.5335 4.9352 5.4309 1.2539 2.3619 2.4675 5.9843 1.4910 3.3924 3.7859 5.7578 3.9155 3.0846 4.5424 5.1146 6.8650 4.4807 4.1674 3.7771 3.3409 3.3916 2.7523 3.0795 1.7003 2.6602 5.5865 4.6566 3.2495 1.5912 5.3836 7.5631 2.3757 6.7392 4.7813 1.2510 4.4468 3.9673 2.6762 1.4678 1.4419 3.1853 3.7781 1.4714 4.8497 1.3426 1.5087 2.5162 2.5908 2.4286 2.2819 1.9705 1.8206 1.6491 2.3437 1.0766 1.5340 1.2215 2.2593 1.8280 1.5493 1.5695 1.7623 1.6399 3.1322 1.5238 1.7340 1.9667 9.1063 1.1928 1.1915 2.2382 1.0502 1.0517 1.9353 1.0670 1.0474 2.2269 6.4581 6.7843 6.0467 9.0227 12.7564 1.0380 1.0361 1.0839 1.0859 1.0962 1.0989 1.1007 1.1003 1.0879 1.0909 1.0871 1.0919 1.0959 1.1005 1.0641 1.0772
irintensity: 0.4060 0.5022 0.3783 2.5065 1.6050 0.8654 7.7151 2.8035 1.8911 1.7275 2.7691 5.1293 3.4568 1.2904 0.9995 4.8784 10.5401 0.3940 4.0666 3.1149 5.5305 0.9253 2.0433 3.5985 4.7840 3.6326 13.7122 16.7270 15.8571 61.4222 39.3512 20.5807 2.0709 105.1632 20.1076 20.6920 11.6543 45.3865 78.3533 40.7314 9.2897 18.5597 5.5446 1.0889 1.4060 22.4538 20.6231 15.7957 2.5342 0.9746 12.7486 3.5931 1.6709 0.0598 1.3455 23.8169 13.8811 84.0025 252.2206 11.4018 6.8264 107.2514 15.1016 3.0333 1.7887 9.5258 8.6274 23.0547 17.9092 9.2156 4.0826 9.0448 29.4151 270.3057 64.7242 47.0188 31.0518 1.5041 21.4647 14.4448 5.3199 3.7093 19.1625 274.2413 14.5036 14.5672 248.5384 83.2766 77.4014 7.3151 179.3867 342.9487 16.8617 21.4958 31.2620 0.9670 14.9930 16.6793 8.3840 20.0966 10.0253 3.4678 1.9110 20.4859 15.2983 21.6359 35.8947 38.3269
temp: 298.150 k
press: 1.00000 atm
elementType: 16 8 8 8 8 7 7 6 6 6 6 6 6 6 6 6 6 6 6 6 6 6 1 1 1 1 1 1 1 1 1 1 1 1 1 1 1 1
symmnumber: 1
zpe: 758727.7 jmol-1
zpe.correction: 0.288984 hartree
zpe.thermalcorrener: 0.309860 hartree
zpe.thermalcorrenthalpy: 0.310804 hartree
zpe.thermalcorrgfe: 0.237484 hartree
zpe.sumelectzpe: -1388.056689 hartree
zpe.sumelectthermal: -1388.035814 hartree
zpe.sumelectthermalent: -1388.034870 hartree
zpe.sumelectthermalfe: -1388.108189 hartree
dipole: 2.5505 5.5125 0.2872
dipole: 6.0807
quadrupole: -103.1365 -138.8367 -148.9354
quadrupole: -5.3819 -0.5113 4.8472
quadrupole: 27.1664 -8.5339 -18.6325 -5.3819 -0.5113 4.8472
hfenergy: -1388.3456736 hartree
pointgroup: C01 [X(C15H16N2O4S1)]
dipole: -0.9786474 2.1511703 0.3714033 debye
polarizability: 280.2738038|-2.0989719|190.9148634|-11.4911061|8.6003257|142.0695272 unknown
InChI: InChI=1S/C15H16N2O4S/c1-15(2)10(14(20)21)17-12(19)9(13(17)22-15)16-11(18)8-6-4-3-5-7-8/h3-7,9-10,13,16,20H,1-2H3
charge 0 multiplicity 1
38 atoms
S  -1.318645 1.11716 1.39091
O  -1.207561 -1.264278 -2.28353
O  -5.735076 -0.183424 0.192998
O  -4.357544 -1.080974 1.838774
O  2.479535 -2.373886 0.060784
N  -2.228468 -0.946718 -0.091291
N  1.072783 -0.522276 0.016732
C  -1.291381 -0.76689 1.040881
C  -2.832653 1.424134 0.183181
C  -3.36629 -0.035803 -0.183138
C  -0.128027 -1.305186 0.12175
C  -1.194323 -1.206936 -1.044457
C  -3.858256 2.302646 0.923839
C  -2.316092 2.115921 -1.096584
C  -4.489376 -0.504406 0.740871
C  2.337055 -1.112624 0.022099
C  3.509762 -0.171122 -0.030783
C  4.755417 -0.707594 -0.446123
C  3.430668 1.198159 0.337801
C  5.898623 0.114348 -0.515904
C  4.577945 2.018722 0.273073
C  5.812309 1.481384 -0.160242
H  -1.533778 -1.301071 1.967092
H  -3.742115 -0.02165 -1.220131
H  0.164328 -2.348621 0.333944
H  -4.159735 1.856822 1.886505
H  -3.426324 3.296923 1.131985
H  -4.758254 2.445567 0.297309
H  -1.773369 3.042467 -0.842207
H  -1.634598 1.464877 -1.670113
H  -3.166931 2.385383 -1.752331
H  0.967127 0.491615 -0.063316
H  -6.460626 -0.474539 0.810567
H  4.799092 -1.770809 -0.703503
H  2.494833 1.630006 0.713785
H  6.854613 -0.307458 -0.844416
H  4.51166 3.071436 0.568653
H  6.70077 2.120496 -0.211468
