program: Gaussian 09
title: 000209779
version: EM64L-G09RevD.01
frameworkgroup: C1[X(C10H13ClNO6P)]
method: RPBEPBE
basis: SDD
operation: Freq
keyword: #p
keyword: freq=noraman
keyword: PBEPBE/SDD
title: #p freq=noraman PBEPBE/SDD
converged: YES YES NO NO
title: Mulliken charges:
elementType: Cl P O O O O O O N C C C C C C C C C C H H H H H H H H H H H H H
charge: 0.040918 1.408732 -0.528791 -0.506701 -0.505909 -0.598753 -0.208138 -0.180027 0.007792 0.391629 -0.257401 -0.217523 -0.316616 -0.376833 0.507162 -0.292787 -0.317303 -0.647006 -0.654159 0.245327 0.234130 0.237249 0.237267 0.342266 0.269297 0.290285 0.226356 0.233823 0.244879 0.213639 0.237301 0.239895
chargesum: 0.00000
title: Mulliken charges with hydrogens summed into heavy atoms:
elementType: Cl P O O O O O O N C C C C C C C C C C
charge: 0.040918 1.408732 -0.528791 -0.506701 -0.505909 -0.598753 -0.208138 -0.180027 0.007792 0.391629 0.222056 0.256992 0.025651 -0.107536 0.507162 -0.292787 -0.027018 0.058052 0.036676
polarizability: 2.52896676e+02 1.00915964e+01 1.67705466e+02 3.49272419e+00 -2.26017770e+01 1.26090205e+02
1716.lowfreq: -13.6485 -4.5806 0.0010 0.0018 0.0021 3.8696 7.0617 16.3741 23.2281
frequency: -12.7040 16.1050 23.0522 36.4909 43.1785 47.5692 54.7818 67.4725 86.5326 116.5798 162.3578 174.8749 189.0079 193.0599 213.1819 232.6478 240.8293 249.3305 274.1517 280.4253 333.9577 345.3647 348.4659 380.4803 403.7986 433.4536 449.6464 473.2694 514.8234 574.0534 580.9091 607.1942 642.2071 664.2268 701.8088 707.9221 723.7137 777.7915 798.2340 811.7434 837.0230 852.4464 879.9886 888.5338 899.5879 971.2331 1004.4478 1011.0299 1018.0437 1056.8652 1092.5223 1107.0240 1119.8211 1130.6803 1137.9162 1140.8475 1195.5037 1213.4896 1251.5932 1266.9588 1269.9155 1351.7492 1354.2796 1355.9083 1388.6860 1395.0557 1395.9469 1403.4534 1456.6327 1458.9101 1462.3616 1465.8986 1478.4455 1478.8800 1488.1890 1564.6855 1594.5738 2989.6255 2997.6636 3012.9751 3022.3269 3079.6657 3080.6388 3092.4193 3094.6298 3114.0610 3118.0414 3156.1526 3173.8640 3192.0293
redmass: 2.7125 6.0000 6.6527 3.3255 14.8585 2.6137 2.7076 4.2285 7.1642 5.4318 4.5711 3.4486 10.7294 5.5193 5.7736 3.7381 1.7010 1.4230 3.9359 5.4701 7.9772 7.7202 7.9268 4.4446 6.5196 5.8716 3.9546 5.9754 8.5758 7.4125 5.7877 7.4196 8.1963 4.5587 6.4041 9.2822 5.2278 10.4212 1.1236 1.0880 1.4646 4.0386 5.0906 6.5603 1.4326 1.3475 2.5283 2.5516 4.3633 11.8272 2.2338 2.3035 2.1702 1.3900 1.4241 1.5541 6.6014 5.3729 1.1578 1.3866 1.1466 2.5742 1.2886 1.5196 12.2087 1.2317 1.2409 4.9874 1.0395 2.4248 1.0949 1.0585 1.0543 1.0564 1.0862 8.6203 6.7352 1.0362 1.0362 1.0568 1.0609 1.1084 1.1004 1.0997 1.0975 1.1059 1.1034 1.0938 1.0886 1.0976
irintensity: 0.5532 0.2036 1.0600 1.8315 0.2654 2.0447 2.4639 2.0110 1.9050 1.6731 2.5392 3.2352 3.2703 1.5959 3.0662 6.0022 2.3396 4.4698 8.9568 6.3235 29.2184 8.9492 11.5191 0.9734 31.5295 22.2297 22.4297 19.4864 29.4312 8.2173 4.4410 26.2822 171.8475 12.0637 73.5659 191.0918 2.1285 16.3229 3.7965 2.3485 37.2456 142.6757 352.9914 154.1663 68.7251 1.0676 183.7006 77.2609 20.9208 101.8704 9.8839 16.4423 4.5118 4.4993 15.6713 9.5438 676.1519 25.0221 0.2313 13.8342 2.6701 31.0365 19.6444 9.5596 48.8363 16.2149 27.4866 50.0372 11.7636 121.3534 19.6108 10.9174 5.4070 15.6233 11.1444 56.6075 291.7466 8.4583 16.1664 19.8860 26.4710 5.0607 19.6912 15.0450 21.6086 23.3988 32.8276 11.7034 1.0020 2.1966
temp: 298.150 k
press: 1.00000 atm
elementType: 17 15 8 8 8 8 8 8 7 6 6 6 6 6 6 6 6 6 6 1 1 1 1 1 1 1 1 1 1 1 1 1
symmnumber: 1
zpe: 595368.9 jmol-1
zpe.correction: 0.226764 hartree
zpe.thermalcorrener: 0.247215 hartree
zpe.thermalcorrenthalpy: 0.248159 hartree
zpe.thermalcorrgfe: 0.173833 hartree
zpe.sumelectzpe: -1694.687563 hartree
zpe.sumelectthermal: -1694.667112 hartree
zpe.sumelectthermalent: -1694.666168 hartree
zpe.sumelectthermalfe: -1694.740494 hartree
dipole: -7.1056 -0.9952 3.6689
dipole: 8.0586
quadrupole: -146.2248 -116.9446 -126.0437
quadrupole: 7.2832 -9.7784 5.4271
quadrupole: -16.4871 12.7931 3.6940 7.2832 -9.7784 5.4271
hfenergy: -1694.9143268 hartree
pointgroup: C01 [X(C10H13Cl1N1O6P1)]
dipole: -2.7568449 0.4172284 -1.5092254 debye
polarizability: 247.6863308|-24.5059854|158.9071841|-4.6439061|-29.6516329|140.0988329 unknown
InChI: InChI=1S/C10H13ClNO6P/c1-3-16-19(15,17-4-2)18-8-5-6-10(12(13)14)9(11)7-8/h5-7H,3-4H2,1-2H3
charge 0 multiplicity 1
32 atoms
Cl 2.650276 -1.628245 1.995762
P  -2.675303 -0.097317 0.574118
O  -1.38797 0.921662 -0.087908
O  -3.189219 -0.984575 -0.8105
O  -3.858795 1.097236 0.768541
O  -2.316565 -0.941651 1.864115
O  4.847461 0.750241 -1.11575
O  4.700916 -1.276398 -0.079637
N  4.183714 -0.174044 -0.496642
C  -0.027148 0.581649 -0.124643
C  -3.031635 -2.480476 -0.813532
C  -4.336619 1.921474 -0.400122
C  0.578887 -0.285354 0.816463
C  0.737765 1.209125 -1.137883
C  2.734197 0.059781 -0.299253
C  1.958584 -0.55342 0.718213
C  2.112802 0.953407 -1.208552
C  -1.632973 -2.889251 -1.27299
C  -5.459868 2.790733 0.149799
H  -3.264096 -2.868353 0.194994
H  -3.811634 -2.79983 -1.523317
H  -3.482906 2.518203 -0.767388
H  -4.682027 1.233097 -1.192312
H  -0.009815 -0.729225 1.625578
H  0.244212 1.881556 -1.843519
H  2.740193 1.427876 -1.967532
H  -1.5831 -3.989375 -1.374588
H  -1.394105 -2.440479 -2.252185
H  -0.86272 -2.58414 -0.542674
H  -5.855287 3.43614 -0.65646
H  -6.283626 2.168724 0.537389
H  -5.0916 3.435328 0.965116
