program: Gaussian 09
title: 000209799
version: EM64L-G09RevD.01
frameworkgroup: C1[X(C17H20Cl2NO4P)]
method: RPBEPBE
basis: SDD
operation: Freq
keyword: #p
keyword: freq=noraman
keyword: PBEPBE/SDD
title: #p freq=noraman PBEPBE/SDD
converged: YES YES NO NO
title: Mulliken charges:
elementType: Cl Cl P O O O O N C C C C C C C C C C C C C C C C C H H H H H H H H H H H H H H H H H H H H
charge: -0.053446 -0.053094 1.324463 -0.524169 -0.538897 -0.606847 -0.265767 -0.517956 -0.285231 -0.309498 -0.572002 -0.552790 0.366162 0.392512 -0.470127 -0.419030 -0.335872 -0.369725 0.352108 -0.167011 -0.372889 -0.197913 -0.191340 -0.244417 -0.537482 0.239906 0.272534 0.238200 0.277678 0.265192 0.305309 0.263851 0.290053 0.312771 0.262030 0.278958 0.252310 0.235186 0.255933 0.231583 0.232592 0.232371 0.245929 0.229405 0.228468
chargesum: 0.00000
title: Mulliken charges with hydrogens summed into heavy atoms:
elementType: Cl Cl P O O O O N C C C C C C C C C C C C C C C C C
charge: -0.053446 -0.053094 1.324463 -0.524169 -0.538897 -0.606847 -0.265767 -0.517956 0.227209 0.206380 -0.001501 0.001114 0.366162 0.392512 -0.157357 -0.157000 -0.056914 -0.117415 0.352108 0.068175 -0.116956 0.033670 0.041252 -0.012046 0.166319
polarizability: 2.54330171e+02 -9.39390406e+00 2.26350574e+02 1.10772073e+01 2.68121819e+00 2.62903212e+02
1716.lowfreq: -7.3692 -5.3235 -0.0008 0.0014 0.0016 1.2484 8.1766 14.9123 21.7180
frequency: 7.1312 14.8282 21.6797 25.5092 27.5232 32.1179 34.7890 59.9395 78.5819 81.5541 91.3181 97.3959 106.8590 146.7738 154.4983 167.0251 195.1184 204.9259 209.1069 212.4681 221.5663 244.9775 263.3116 275.2401 283.0224 304.5418 320.9823 367.0440 409.8744 416.4681 432.5275 440.4107 454.2189 482.2156 487.4376 519.6654 544.9918 548.2767 600.3675 606.9953 621.5609 663.7054 677.3572 689.2254 690.3745 695.1164 724.9418 757.5620 765.7388 774.7463 778.0201 785.2262 829.4072 835.1051 874.9331 883.9729 907.0340 914.3374 955.4915 968.8557 970.0458 978.2630 986.6874 990.9165 997.8060 999.5683 1019.8951 1031.0051 1041.9823 1048.5880 1062.7911 1072.6673 1076.6396 1111.1656 1113.3883 1134.6503 1156.8533 1157.3380 1165.0010 1171.3249 1184.1377 1204.8032 1234.0264 1245.8290 1253.9927 1257.6950 1289.9195 1300.1777 1309.8685 1332.4173 1352.3143 1361.9604 1381.8161 1390.4752 1420.0210 1441.1002 1442.6208 1449.7682 1456.2500 1464.6722 1467.6140 1468.8368 1470.1405 1473.3927 1484.2187 1589.2040 1595.6578 1603.9919 1610.5332 2967.5509 3013.2405 3024.6867 3057.8928 3061.8697 3063.7097 3084.7545 3091.7378 3130.9740 3133.2654 3142.9267 3144.5788 3149.9857 3152.3034 3155.9177 3163.5520 3166.0753 3170.6775 3176.5067 3181.2885
redmass: 9.7534 6.0671 5.7805 4.0816 6.6843 9.6016 9.2598 5.6072 4.3379 2.9028 2.2872 5.6765 3.3055 4.7573 5.7003 4.3082 2.4810 3.2457 3.9396 4.5081 9.3060 6.1313 2.0632 5.7796 4.3236 4.8405 4.8178 5.9342 2.9660 5.1607 6.2825 5.9389 3.1501 5.0079 5.4740 7.8613 5.3251 5.2114 5.6168 6.3567 7.2691 8.5212 7.7834 2.1633 2.2122 5.5173 4.8611 5.0174 1.7099 1.1587 1.2234 1.4020 6.1933 1.3045 1.5334 1.3980 5.8718 1.4185 2.7167 1.3201 1.3721 5.5415 5.0735 1.3810 1.7134 3.4313 2.1826 3.4434 3.3538 4.3218 2.0652 1.5179 1.5339 1.2613 1.6778 1.9947 1.6520 1.5518 1.1772 1.1184 1.3634 2.3474 1.5942 4.9810 1.1729 1.1584 1.1528 1.2959 1.3197 1.2379 1.2321 1.2612 9.4241 8.5493 2.1465 2.2310 1.3845 1.0865 1.0956 1.0933 1.0536 1.3815 1.8419 1.0862 1.8142 6.3346 6.2217 6.7198 7.0043 1.0326 1.0629 1.0613 1.1041 1.0566 1.0573 1.1015 1.1044 1.1002 1.0852 1.0893 1.0876 1.1124 1.1118 1.0938 1.0922 1.0973 1.0927 1.1002 1.0987
irintensity: 0.0426 0.1827 0.0824 0.0355 0.2450 0.1820 0.2740 3.2606 0.4861 1.6664 4.4213 5.0088 5.5018 1.0396 1.6740 0.2906 1.2692 2.8081 4.8424 0.9605 3.2987 3.9349 2.3367 11.2428 18.1816 17.6121 0.6409 4.6464 2.4510 25.1941 22.6327 47.6382 5.5584 2.9233 62.5768 7.3973 12.5038 9.0646 7.6244 8.3119 14.6608 71.9439 38.6054 15.7531 24.4280 93.4654 135.9184 69.2006 183.1941 3.9877 14.6079 55.4581 276.2152 19.8448 55.4755 7.2512 225.5229 15.6176 153.4614 4.2170 0.5033 5.3698 2.1537 1.3271 15.6630 64.9171 21.2117 39.5873 18.6233 17.1380 54.7810 16.3072 8.0359 0.2019 49.5376 182.9389 76.2114 48.0617 7.7733 14.2022 50.3727 64.1902 12.9270 135.4116 16.9298 7.5695 6.2837 0.6078 0.2438 16.6799 0.9625 1.1490 0.5743 11.3580 13.7140 10.1654 56.1083 9.7873 6.0581 22.4471 20.6582 128.6132 88.7225 6.7390 41.9686 174.9261 37.3431 24.6381 115.0320 41.8238 15.1861 10.0927 38.6350 10.0111 14.8026 3.4824 1.2195 26.5117 0.4547 11.7051 10.1760 8.3286 6.5812 15.2116 4.5648 17.0547 4.8899 9.0179 6.1650
temp: 298.150 k
press: 1.00000 atm
elementType: 17 17 15 8 8 8 8 7 6 6 6 6 6 6 6 6 6 6 6 6 6 6 6 6 6 1 1 1 1 1 1 1 1 1 1 1 1 1 1 1 1 1 1 1 1
symmnumber: 1
zpe: 897459.5 jmol-1
zpe.correction: 0.341824 hartree
zpe.thermalcorrener: 0.368469 hartree
zpe.thermalcorrenthalpy: 0.369414 hartree
zpe.thermalcorrgfe: 0.278109 hartree
zpe.sumelectzpe: -2274.911716 hartree
zpe.sumelectthermal: -2274.885071 hartree
zpe.sumelectthermalent: -2274.884127 hartree
zpe.sumelectthermalfe: -2274.975432 hartree
dipole: 0.7280 -1.5643 0.1711
dipole: 1.7338
quadrupole: -161.0821 -176.5082 -170.9950
quadrupole: -4.9013 6.2221 5.3608
quadrupole: 8.4463 -6.9798 -1.4665 -4.9013 6.2221 5.3608
hfenergy: -2275.2535407 hartree
pointgroup: C01 [X(C17H20Cl2N1O4P1)]
dipole: 0.1494126 0.6509379 0.1388316 debye
polarizability: 254.0449784|17.2757028|232.1357331|-9.1077321|-3.7224378|257.4032452 unknown
InChI: InChI=1S/C17H20Cl2NO4P/c1-22-16-8-5-9-17(14-16)24-25(21,20(12-10-18)13-11-19)23-15-6-3-2-4-7-15/h2-9,14H,10-13H2,1H3
charge 0 multiplicity 1
45 atoms
Cl 0.005296 -2.183306 -4.728446
Cl 0.39699 -5.803884 1.313118
P  0.502391 -0.701977 0.349317
O  -0.071623 0.645751 -0.604645
O  2.191881 -0.388463 0.123577
O  -0.04464 -0.835203 1.838112
O  -4.655074 1.15992 1.231005
N  0.281423 -2.122248 -0.593766
C  0.680503 -2.165277 -2.020605
C  -0.175329 -3.367077 0.071757
C  -0.550969 -2.021412 -2.930145
C  1.016252 -4.145857 0.653739
C  -1.455614 1.000487 -0.695287
C  2.835902 0.781402 0.642114
C  -2.337974 0.844818 0.397549
C  -1.860515 1.560603 -1.922235
C  2.626193 1.213247 1.970119
C  3.743513 1.429709 -0.218878
C  -3.681738 1.263409 0.23112
C  -3.206445 1.980371 -2.052132
C  -4.120525 1.831933 -0.992606
C  3.347733 2.336108 2.434553
C  4.465782 2.542392 0.267004
C  4.267676 3.000837 1.590691
C  -4.2474 0.590446 2.520928
H  1.195134 -3.122004 -2.227156
H  1.40121 -1.35692 -2.230651
H  -0.70607 -3.985736 -0.673534
H  -0.887428 -3.12023 0.877087
H  -1.290651 -2.820831 -2.774481
H  -1.022507 -1.032923 -2.841605
H  1.775921 -4.387369 -0.104399
H  1.468506 -3.62809 1.511982
H  -1.97073 0.425448 1.33848
H  -1.136731 1.679731 -2.733196
H  1.920361 0.68402 2.618984
H  3.872827 1.062767 -1.2413
H  -3.540794 2.424664 -2.995485
H  -5.163286 2.148176 -1.083133
H  3.193262 2.684852 3.461393
H  5.176606 3.052668 -0.391863
H  4.825867 3.867127 1.960978
H  -5.157942 0.598626 3.137175
H  -3.463187 1.206568 3.000793
H  -3.881457 -0.447568 2.404073
