program: Gaussian 09
title: 000209749
version: EM64L-G09RevD.01
frameworkgroup: C1[X(C14H18N2O)]
method: RPBEPBE
basis: SDD
operation: Freq
keyword: #p
keyword: freq=noraman
keyword: PBEPBE/SDD
title: #p freq=noraman PBEPBE/SDD
converged: YES YES NO NO
title: Mulliken charges:
elementType: O N N C C C C C C C C C C C C C C H H H H H H H H H H H H H H H H H H
charge: -0.288069 -0.469862 -0.416779 0.312676 0.098187 -0.588389 0.306431 -0.352573 -0.327552 -0.385914 -0.352066 -0.406746 -0.364290 0.279576 -0.235312 -0.252764 -0.685190 0.237137 0.236907 0.290520 0.217794 0.193349 0.206176 0.260748 0.191925 0.188049 0.287948 0.241521 0.204946 0.282707 0.224480 0.223397 0.215177 0.215249 0.210605
chargesum: 0.00000
title: Mulliken charges with hydrogens summed into heavy atoms:
elementType: O N N C C C C C C C C C C C C C C
charge: -0.288069 -0.181913 -0.134072 0.312676 0.098187 -0.114345 0.306431 -0.062053 0.083591 0.081011 0.027907 -0.165226 -0.159344 0.279576 -0.010833 -0.029366 -0.044159
polarizability: 2.34659956e+02 8.66115888e+00 1.78158535e+02 1.47519516e+01 -1.90850259e+01 1.03665706e+02
1716.lowfreq: -7.6247 -3.6137 -0.0007 -0.0006 0.0004 8.2388 12.2814 22.5125 54.4477
frequency: 11.8334 22.1924 54.4398 65.4585 77.4133 99.7650 118.8652 161.6292 194.4367 205.8412 228.0573 239.6391 270.9952 276.0052 299.4823 350.9945 398.0573 411.9812 445.2740 477.3230 508.5101 542.2592 557.6638 591.2548 619.6525 678.8982 705.6842 706.3604 717.9366 736.6967 767.0305 788.6943 805.7783 828.0406 832.0110 850.7712 855.6281 916.4800 917.2880 949.7389 972.3723 974.4136 978.5920 996.9520 1022.7139 1047.4602 1073.5217 1105.5752 1109.6880 1117.4873 1131.3500 1145.7799 1169.5379 1195.3615 1204.0987 1210.9289 1227.8319 1257.1104 1259.7983 1286.3260 1293.9945 1306.6817 1324.9484 1348.8590 1364.4163 1391.2403 1400.1305 1422.3846 1447.0395 1452.1149 1456.5813 1461.5148 1472.7729 1477.3661 1485.2588 1487.2426 1511.4280 1589.2168 1619.9025 1624.3538 1645.8471 2955.3631 2970.1390 2974.3202 2976.3148 2982.8838 3000.5841 3008.4712 3043.1076 3071.8982 3074.2592 3076.0095 3100.2282 3123.5702 3137.7199 3159.4888 3235.7097 3536.9527 3555.0006
redmass: 3.7707 4.1583 4.5955 3.2687 2.1120 3.7273 3.1615 3.1270 4.3547 3.9796 1.2702 2.5352 2.3669 2.0723 3.2534 1.5271 2.8792 2.7432 4.0942 3.1033 2.6046 6.6395 1.2329 5.9834 3.8074 4.0493 4.4858 9.0162 1.7512 1.3173 1.9955 2.7450 1.2723 2.7185 3.3359 1.3353 1.7834 1.8911 1.6188 1.6967 2.0575 1.7155 1.3283 2.0878 2.2066 3.2235 2.9953 2.4592 1.1374 2.0333 1.9013 2.0084 1.1359 2.1254 1.9528 1.6157 1.3544 1.6170 1.5718 1.1049 1.6429 1.2815 2.5820 1.5304 1.3318 1.2117 4.0268 1.2183 2.2343 1.1686 1.0946 2.3858 1.0711 1.0427 1.1459 1.6279 2.5488 6.4931 7.1017 5.5636 5.6610 1.0587 1.0607 1.0436 1.0533 1.0672 1.0990 1.0982 1.1011 1.1003 1.0995 1.0976 1.0883 1.0873 1.0931 1.0998 1.0964 1.0765 1.0769
irintensity: 0.3073 0.0202 4.9811 5.6384 3.4997 2.8367 1.1569 0.2903 0.4045 3.1368 0.2593 4.5677 1.4643 9.4859 8.9051 37.6227 14.1329 2.1441 0.3704 3.5161 1.0505 1.4429 177.9577 3.2303 1.2553 3.2619 11.2188 6.3868 42.8798 12.4202 58.9355 1.1756 56.0003 1.1254 1.2610 0.0441 2.5522 3.1498 4.4977 0.4617 0.1338 26.0488 0.1644 5.6377 9.8044 2.6589 6.9556 4.1624 1.3087 3.7042 1.9715 0.5462 0.4256 18.4854 157.5550 50.1654 25.2261 0.7082 145.8059 0.8283 1.3530 38.8487 36.5657 1.9573 2.3987 9.2500 3.3410 16.2854 21.1907 34.5722 5.9726 54.2234 14.5653 9.2770 53.1056 215.3605 600.9936 52.3085 2.9710 50.1223 182.7024 30.6710 27.1049 18.2339 65.5149 52.6767 8.6746 11.8808 56.3098 76.7061 38.6904 18.3913 26.1945 1.0010 31.2530 32.9203 2.0599 9.9967 14.8843
temp: 298.150 k
press: 1.00000 atm
elementType: 8 7 7 6 6 6 6 6 6 6 6 6 6 6 6 6 6 1 1 1 1 1 1 1 1 1 1 1 1 1 1 1 1 1 1
symmnumber: 1
zpe: 767633.4 jmol-1
zpe.correction: 0.292376 hartree
zpe.thermalcorrener: 0.309175 hartree
zpe.thermalcorrenthalpy: 0.310120 hartree
zpe.thermalcorrgfe: 0.245267 hartree
zpe.sumelectzpe: -727.778038 hartree
zpe.sumelectthermal: -727.761239 hartree
zpe.sumelectthermalent: -727.760294 hartree
zpe.sumelectthermalfe: -727.825147 hartree
dipole: -0.9652 3.4217 -0.9525
dipole: 3.6806
quadrupole: -86.5282 -101.2151 -103.7603
quadrupole: -6.2062 5.5791 -4.8392
quadrupole: 10.6397 -4.0472 -6.5924 -6.2062 5.5791 -4.8392
hfenergy: -728.0704139 hartree
pointgroup: C01 [X(C14H18N2O1)]
dipole: -0.3264524 1.3781605 -0.3017043 debye
polarizability: 235.4628849|5.4852464|179.3780814|13.3499051|-15.7933029|101.6432315 unknown
InChI: InChI=1S/C14H18N2O/c1-2-3-10-15-14(17)16-13-9-8-11-6-4-5-7-12(11)13/h4-7,9,15-16H,2-3,8,10H2,1H3
charge 0 multiplicity 1
35 atoms
O  -1.585686 -2.006192 -0.19556
N  -0.246422 -0.088362 -0.462063
N  -2.549908 0.006613 -0.907188
C  3.305412 -0.618881 0.346557
C  2.212465 0.197648 -0.070369
C  2.792109 -2.025558 0.611347
C  0.994052 -0.642369 -0.08545
C  1.306224 -1.926593 0.304477
C  -4.804977 -0.117489 0.228771
C  -3.914797 -0.542035 -0.963181
C  -5.082926 1.401741 0.297196
C  4.597299 -0.078416 0.451775
C  2.409232 1.561636 -0.383524
C  -1.471773 -0.780925 -0.498616
C  4.799068 1.291237 0.137407
C  3.713742 2.101705 -0.276148
C  -6.006897 1.784374 1.47373
H  3.297472 -2.774933 -0.032095
H  2.97911 -2.341324 1.658344
H  0.598126 -2.749423 0.38099
H  -4.326734 -0.455266 1.168804
H  -5.769686 -0.659448 0.148253
H  -4.386874 -0.231455 -1.916742
H  -3.804585 -1.639938 -0.977108
H  -5.541258 1.733526 -0.657873
H  -4.123569 1.950518 0.397602
H  -0.23516 0.895061 -0.736622
H  5.441259 -0.700742 0.77163
H  1.583196 2.20991 -0.705304
H  -2.420629 0.999498 -1.103947
H  5.801378 1.727105 0.214833
H  3.886764 3.157192 -0.514723
H  -5.556879 1.489998 2.440249
H  -6.196263 2.8730 1.505096
H  -6.984084 1.272589 1.390352
