program: Gaussian 09
title: 000209741
version: EM64L-G09RevD.01
frameworkgroup: C1[X(C14H14NO)]
method: RPBEPBE
basis: SDD
operation: Freq
keyword: #p
keyword: freq=noraman
keyword: PBEPBE/SDD
title: #p freq=noraman PBEPBE/SDD
converged: YES YES NO NO
title: Mulliken charges:
elementType: O N C C C C C C C C C C C C C C H H H H H H H H H H H H H H
charge: -0.385329 -0.072535 0.496012 -0.300800 -0.310199 0.515829 -0.310554 -0.177308 -0.173919 -0.275058 -0.586842 -0.338606 -0.356342 -0.377660 -0.343825 0.298147 0.250743 0.260625 0.230849 0.275292 0.277405 0.222407 0.259805 0.280752 0.259481 0.233593 0.243819 0.244776 0.278825 0.380616
chargesum: 1.00000
title: Mulliken charges with hydrogens summed into heavy atoms:
elementType: O N C C C C C C C C C C C C C C
charge: -0.004713 -0.072535 0.496012 -0.050056 -0.049574 0.515829 -0.079705 0.097984 0.103485 -0.052651 0.213196 -0.105013 -0.112523 -0.132884 -0.065000 0.298147
polarizability: 5.09095593e+02 -1.05956074e+00 1.48690226e+02 -1.03860989e+00 -3.06420389e-02 6.51675771e+01
1716.lowfreq: -31.5499 -4.3019 -0.0004 -0.0002 0.0006 0.8441 9.4373 36.8097 38.7508
frequency: -30.4313 36.8055 38.6961 63.0284 83.6639 167.9644 173.0219 211.2060 245.0781 300.1395 356.4286 357.4291 398.5509 406.7067 415.2279 455.9471 466.0554 482.6663 486.6547 528.3634 571.6885 631.2443 661.2394 709.2855 736.0416 758.7805 789.9678 809.5107 827.5367 835.3318 836.0882 846.2098 872.6064 902.9287 949.5475 960.8793 969.3873 972.4825 987.5240 994.6252 1028.4629 1051.2437 1103.1070 1118.2898 1143.7654 1156.4423 1184.3459 1192.3930 1221.7860 1228.2606 1258.1223 1283.2925 1301.1258 1327.7583 1342.2236 1353.3749 1373.0512 1403.3952 1436.6115 1455.6050 1471.9490 1474.2515 1481.9455 1501.0149 1519.5734 1525.2586 1564.5657 1599.6137 1633.6794 1654.6743 3015.3666 3097.9716 3116.8900 3126.0371 3131.0048 3138.2031 3138.5564 3159.4145 3171.0214 3178.7307 3184.8437 3195.6879 3200.8071 3568.7222
redmass: 1.0368 4.5988 3.7424 4.7544 4.7941 4.2193 5.6392 2.8920 5.4780 3.1223 3.7029 3.3570 3.4546 2.5152 2.7590 1.2171 7.3104 3.8164 2.4931 2.4193 5.9976 6.9568 6.8491 3.3136 3.5174 4.8773 5.3721 1.3178 1.4490 1.3079 5.9082 1.5828 4.2691 1.8916 1.3300 1.3367 1.3219 1.3710 1.2823 2.7682 2.8777 1.6132 1.5366 1.3436 1.2582 1.3417 1.5441 2.0827 1.6653 1.5970 1.3055 2.2703 1.5664 2.1473 1.3500 1.7618 2.4948 2.8872 1.2443 4.3279 1.2138 1.0890 2.9871 2.3213 2.8026 3.8242 5.6699 4.4428 5.7207 5.6716 1.0348 1.0899 1.1021 1.0887 1.0893 1.0907 1.1034 1.0957 1.0901 1.0892 1.0960 1.0978 1.1006 1.0665
irintensity: 0.2547 0.4425 2.0032 0.6883 0.3394 0.2680 2.0468 0.0544 5.7257 3.5725 0.1665 4.2113 8.2459 14.1510 1.5554 133.2721 20.5299 0.6990 0.4052 74.2587 25.1207 4.8119 0.0544 2.2631 1.6304 2.9349 3.6774 13.7695 0.7019 3.7487 0.2479 104.7688 4.3573 15.3536 11.6235 8.7358 5.1825 2.0279 27.8810 0.8468 1.5980 0.5693 257.5748 38.8878 402.0751 6.1504 372.4896 43.4606 81.3524 5.9310 7.0251 146.8917 55.9792 8.5837 67.3674 111.3772 22.4279 147.0054 0.3310 17.6323 15.5633 25.4063 29.9216 4.7939 132.3783 38.0113 8.1427 2278.4974 7.6954 169.0242 27.4402 4.4842 5.1398 10.8475 4.6987 5.7136 3.0592 8.3119 0.3233 0.5801 2.2541 0.1486 0.0965 240.8147
temp: 298.150 k
press: 1.00000 atm
elementType: 8 7 6 6 6 6 6 6 6 6 6 6 6 6 6 6 1 1 1 1 1 1 1 1 1 1 1 1 1 1
symmnumber: 1
zpe: 640654.0 jmol-1
zpe.correction: 0.244012 hartree
zpe.thermalcorrener: 0.257506 hartree
zpe.thermalcorrenthalpy: 0.258451 hartree
zpe.thermalcorrgfe: 0.202643 hartree
zpe.sumelectzpe: -670.506730 hartree
zpe.sumelectthermal: -670.493236 hartree
zpe.sumelectthermalent: -670.492292 hartree
zpe.sumelectthermalfe: -670.548099 hartree
dipole: -8.4836 1.3320 0.0527
dipole: 8.5877
quadrupole: 19.4090 -68.9414 -98.4036
quadrupole: 12.7057 -0.2625 0.0110
quadrupole: 68.7210 -19.6294 -49.0916 12.7057 -0.2625 0.0110
hfenergy: -670.7507427 hartree
pointgroup: C01 [X(C14H14N1O1)]
dipole: -3.3423823 -0.4937842 0.0074654 debye
polarizability: 509.0809147|-2.2240346|148.6815999|-1.7062632|-1.2572992|65.1908812 unknown
InChI: InChI=1S/C14H14NO/c1-15-10-8-13(9-11-15)3-2-12-4-6-14(16)7-5-12/h2-11,16H,1H3
charge 1 multiplicity 1
30 atoms
O  6.151388 -0.165503 -0.047836
N  -4.734599 0.134618 0.032902
C  -1.905934 -0.269548 0.0085
C  -2.493231 1.045383 -0.005141
C  -2.840279 -1.363021 0.032734
C  1.942048 0.204364 -0.024517
C  -0.488609 -0.537688 0.002336
C  -3.870579 1.2167 0.006409
C  -4.212225 -1.14651 0.043544
C  0.511343 0.424735 -0.017495
C  -6.207309 0.347732 -0.000847
C  2.542074 -1.096538 -0.011107
C  2.812636 1.344566 -0.045756
C  3.932406 -1.251166 -0.01838
C  4.203025 1.205055 -0.053278
C  4.770006 -0.097504 -0.039529
H  -1.87289 1.94392 -0.022115
H  -2.478258 -2.394834 0.046285
H  -0.207547 -1.59788 0.014994
H  -4.333764 2.205687 -0.004848
H  -4.933212 -1.966444 0.060666
H  0.212488 1.48319 -0.029297
H  -6.457621 1.289182 0.511206
H  -6.563001 0.393419 -1.044164
H  -6.712821 -0.478918 0.520811
H  1.916053 -1.994277 0.00527
H  2.377509 2.350742 -0.056408
H  4.375481 -2.254386 -0.007761
H  4.87154 2.069661 -0.069445
H  6.493785 -1.095139 -0.037632
