program: Gaussian 09
title: 000209742
version: EM64L-G09RevD.01
frameworkgroup: C1[X(C13H16N2O2)]
method: RPBEPBE
basis: SDD
operation: Freq
keyword: #p
keyword: freq=noraman
keyword: PBEPBE/SDD
title: #p freq=noraman PBEPBE/SDD
converged: YES YES NO NO
title: Mulliken charges:
elementType: O O N N C C C C C C C C C C C C C H H H H H H H H H H H H H H H H
charge: -0.299298 -0.296907 -0.465735 -0.412577 0.312663 0.098718 -0.588061 0.304552 -0.353538 -0.406911 -0.364719 -0.235753 -0.252611 0.274727 -0.362791 -0.252856 -0.491664 0.235953 0.236742 0.290140 0.241073 0.206970 0.291462 0.224070 0.223197 0.229502 0.254294 0.308561 0.197301 0.207637 0.205459 0.233169 0.207231
chargesum: 0.00000
title: Mulliken charges with hydrogens summed into heavy atoms:
elementType: O O N N C C C C C C C C C C C C C
charge: -0.299298 -0.296907 -0.174273 -0.104016 0.312663 0.098718 -0.115366 0.304552 -0.063398 -0.165838 -0.157750 -0.011683 -0.029413 0.274727 0.121005 0.152082 0.154195
polarizability: 2.27883011e+02 -5.75829230e+00 1.80531629e+02 -9.62575219e+00 -1.18599814e+01 8.84250148e+01
1716.lowfreq: -6.3431 -4.7067 0.0005 0.0006 0.0008 3.6676 15.2081 30.8766 51.1936
frequency: 15.0718 30.8713 51.1542 66.6029 90.8034 102.1717 108.1422 163.4827 196.3471 205.0707 215.4917 253.2201 277.1097 279.8962 299.4293 389.2143 410.7942 428.8376 444.1832 481.4807 524.3845 542.7790 591.1677 593.9493 619.5542 691.7550 706.1805 710.3892 717.9327 767.1957 784.3659 804.9922 808.6289 831.5497 851.4346 896.6421 917.4736 949.6154 963.9999 978.0354 988.8553 1013.0363 1022.0077 1064.3033 1072.5823 1090.1032 1109.3772 1112.6016 1120.5004 1146.3681 1154.6764 1169.0135 1194.2900 1200.6019 1209.3189 1218.6264 1253.1122 1260.6857 1293.2126 1324.2892 1354.8407 1373.6982 1400.1006 1422.6811 1437.4336 1447.1876 1458.3361 1460.1992 1462.6083 1465.3341 1479.5349 1488.1705 1510.2218 1589.0992 1619.3967 1623.6537 1642.4212 2929.2960 2939.0513 2969.1444 2981.5677 3003.4373 3007.3729 3007.6246 3079.2633 3101.6725 3103.9123 3123.2906 3137.6238 3159.2504 3234.9465 3537.5616 3548.6877
redmass: 3.9270 4.0229 3.6554 4.9121 3.6122 3.4614 3.4224 3.2566 5.3500 3.9740 1.3043 3.9547 2.1331 2.3670 3.9933 2.5628 2.6138 1.4835 4.0762 3.0732 2.6375 6.3947 4.8971 1.3074 3.7846 4.6449 7.2349 5.9742 1.7506 1.9953 2.9752 1.2784 4.0521 4.4768 1.3362 2.7950 1.6168 1.7023 2.6590 1.3291 2.0154 2.9841 2.1926 4.3243 2.9131 1.8867 1.1375 2.3529 1.3880 1.8982 1.4710 1.1389 1.8831 1.3207 1.6807 1.6376 1.4932 1.6767 1.6248 2.6311 1.3065 1.3967 4.0790 1.2206 1.1537 2.3445 1.0593 2.1714 1.1705 1.0781 1.1280 1.7964 2.6605 6.5202 7.1192 5.3556 6.0442 1.0389 1.0499 1.0607 1.0800 1.0928 1.0982 1.1032 1.0963 1.0882 1.0979 1.0873 1.0932 1.0999 1.0964 1.0766 1.0767
irintensity: 0.6223 0.6072 0.8441 6.9871 6.6570 2.2217 13.5900 0.3107 0.0405 2.5189 5.6923 7.2453 10.6122 3.3365 12.1406 19.2569 5.0782 1.4467 0.1634 1.1417 3.0925 0.8473 16.3972 193.0572 1.6770 1.7461 4.5382 7.4156 46.7110 59.9839 2.1217 56.5222 3.6720 1.0219 0.0716 3.8575 4.6323 0.4925 7.4105 0.1350 17.1850 34.3507 8.8515 119.6647 2.8193 4.1971 1.3806 13.9954 0.9623 18.4332 8.6548 0.4849 13.8352 51.4706 4.4913 77.5264 32.0915 197.7673 3.7752 28.8583 10.8283 2.4483 2.9807 16.3686 4.9048 22.2175 13.5209 45.2714 60.1211 8.6131 44.6276 250.7415 637.4940 50.9399 1.6857 47.3171 204.4293 54.9773 98.0925 27.8924 1.3681 169.0848 11.9344 38.2648 6.9721 24.6366 28.2999 1.0641 31.7460 33.0889 1.9799 13.2590 42.6725
temp: 298.150 k
press: 1.00000 atm
elementType: 8 8 7 7 6 6 6 6 6 6 6 6 6 6 6 6 6 1 1 1 1 1 1 1 1 1 1 1 1 1 1 1 1
symmnumber: 1
zpe: 705064.5 jmol-1
zpe.correction: 0.268545 hartree
zpe.thermalcorrener: 0.285020 hartree
zpe.thermalcorrenthalpy: 0.285964 hartree
zpe.thermalcorrgfe: 0.222115 hartree
zpe.sumelectzpe: -763.676219 hartree
zpe.sumelectthermal: -763.659744 hartree
zpe.sumelectthermalent: -763.658800 hartree
zpe.sumelectthermalfe: -763.722649 hartree
dipole: 2.2761 3.1902 0.8452
dipole: 4.0090
quadrupole: -74.0011 -98.9045 -103.8022
quadrupole: 6.5426 3.8766 -0.9611
quadrupole: 18.2349 -6.6686 -11.5663 6.5426 3.8766 -0.9611
hfenergy: -763.944764 hartree
pointgroup: C01 [X(C13H16N2O2)]
dipole: -0.8298831 -1.2507823 0.4843816 debye
polarizability: 228.3789564|-2.2496549|181.6832734|9.0735679|1.3040834|86.7774252 unknown
InChI: InChI=1S/C13H16N2O2/c1-17-9-8-14-13(16)15-12-7-6-10-4-2-3-5-11(10)12/h2-5,7,14-15H,6,8-9H2,1H3
charge 0 multiplicity 1
33 atoms
O  -4.902022 -1.374772 0.091048
O  -1.529951 2.178043 -0.309492
N  -0.292479 0.174035 -0.293467
N  -2.621299 0.119405 -0.544826
C  3.326875 0.648039 0.177757
C  2.174643 -0.168985 -0.021542
C  2.890971 2.104072 0.231149
C  0.992726 0.718454 -0.100128
C  1.384013 2.032104 0.042765
C  4.600463 0.066892 0.289045
C  2.29343 -1.574487 -0.110378
C  4.724014 -1.344575 0.200079
C  3.57978 -2.155462 0.002124
C  -1.487976 0.911766 -0.37782
C  -3.959377 0.705175 -0.651461
C  -4.909379 0.071575 0.367619
C  -5.734564 -2.130631 1.024364
H  3.166275 2.580044 1.194819
H  3.378217 2.707864 -0.561942
H  0.716758 2.891615 0.021367
H  5.489663 0.689631 0.44216
H  1.421086 -2.223755 -0.263393
H  -0.343651 -0.840635 -0.3957
H  5.711135 -1.812626 0.284797
H  3.692544 -3.243494 -0.064545
H  -4.368932 0.554097 -1.669596
H  -3.861079 1.790141 -0.474646
H  -2.584565 -0.90149 -0.518613
H  -5.936397 0.480711 0.249441
H  -4.558279 0.261938 1.404895
H  -5.380514 -2.015277 2.070947
H  -5.657443 -3.187817 0.725314
H  -6.796282 -1.810196 0.969259
