program: Gaussian 09
title: 000209702
version: EM64L-G09RevD.01
frameworkgroup: C1[X(C17H14N2O2)]
method: RPBEPBE
basis: SDD
operation: Freq
keyword: #p
keyword: freq=noraman
keyword: PBEPBE/SDD
title: #p freq=noraman PBEPBE/SDD
converged: NO YES NO NO
title: Mulliken charges:
elementType: O O N N C C C C C C C C C C C C C C C C C H H H H H H H H H H H H H H
charge: -0.255200 -0.264042 -0.430070 -0.052127 0.275229 0.011347 0.071574 -0.359145 -0.339763 0.043489 -0.208334 0.492510 -0.230267 -0.298777 -0.256913 -0.357754 -0.394654 0.323717 -0.360999 -0.369439 -0.536792 0.339308 0.240546 0.251663 0.226773 0.228136 0.265174 0.263659 0.241769 0.236948 0.255344 0.244721 0.250084 0.226160 0.226123
chargesum: 0.00000
title: Mulliken charges with hydrogens summed into heavy atoms:
elementType: O O N N C C C C C C C C C C C C C C C C C
charge: -0.255200 -0.264042 -0.090762 -0.052127 0.275229 0.011347 0.071574 -0.118599 -0.088100 0.043489 0.018439 0.492510 -0.002131 -0.033603 0.006746 -0.115984 -0.157706 0.323717 -0.105655 -0.124717 0.165575
polarizability: 5.35528587e+02 6.23442121e+00 2.10051432e+02 -1.08032548e-01 5.31618183e-02 8.30292482e+01
1716.lowfreq: -6.3530 -0.0010 -0.0008 -0.0006 2.1797 3.0280 23.6867 33.5793 37.2530
frequency: 23.6411 33.5786 37.0785 58.6091 100.6197 115.2983 118.1755 165.8074 176.4250 196.6988 220.8535 240.8045 261.7181 270.8181 293.0625 365.0574 374.3583 419.9766 420.7641 433.0027 440.2237 516.9437 536.1861 544.0375 574.3058 583.3716 616.8390 619.3794 632.0740 707.2506 714.3386 727.6306 755.9607 765.9614 770.9771 773.5787 811.9667 813.9503 840.9030 859.2088 876.5455 881.6073 908.9332 942.6849 950.3257 955.9168 974.1851 981.0267 982.9694 998.9849 1004.6705 1015.4897 1077.8922 1111.3319 1113.6291 1114.2747 1155.5438 1158.1237 1178.7245 1197.0087 1218.2276 1219.8275 1245.3324 1262.8212 1290.1481 1298.8017 1316.3179 1331.4683 1369.7891 1386.6691 1405.7552 1421.9715 1434.6609 1436.6116 1466.6318 1470.5005 1479.7455 1497.1527 1506.5623 1518.0054 1566.3004 1586.1166 1617.5149 1630.6708 1633.1879 2967.1630 3058.7898 3089.9084 3129.0682 3132.2101 3133.7039 3145.7503 3147.3307 3151.2054 3161.2966 3163.9746 3172.9800 3174.0444 3576.0135
redmass: 3.9378 5.9728 4.3872 5.0127 6.7510 4.2048 5.5994 3.9136 5.7144 1.5789 5.5700 1.7366 4.8437 4.6721 5.1232 6.8574 3.8170 2.9061 5.0888 2.9476 4.7503 2.4174 5.2848 5.2841 3.6924 7.7990 6.4046 6.1772 6.8491 6.0166 1.1413 3.3677 1.6698 3.5215 5.7182 3.1269 5.4439 1.3183 1.6012 1.5399 5.2081 5.4209 1.8987 1.3788 1.3850 6.7389 1.3587 1.3120 8.8172 2.6450 2.1305 1.1721 2.8880 1.2593 1.5534 1.4121 1.3327 1.1716 1.2679 1.5402 1.8704 2.2264 2.9095 2.5235 1.5117 2.2783 1.3764 2.4342 5.3857 4.1237 3.2004 3.2092 1.6918 1.9560 1.0499 1.0815 3.7242 3.3810 3.3745 10.6517 6.7041 6.8482 6.0371 7.4334 5.7003 1.0326 1.1043 1.0893 1.0900 1.0993 1.0856 1.0898 1.0902 1.0895 1.0962 1.0946 1.0969 1.0994 1.0811
irintensity: 2.8325 0.9832 0.6408 0.2772 0.2119 9.5653 8.0625 0.0312 0.3127 0.7685 2.7387 0.7005 5.9425 10.3666 0.7531 4.8582 2.5404 0.2498 40.8090 11.8023 14.2370 18.1713 22.4148 38.9801 1.9732 2.0674 3.2525 1.0380 4.8474 6.0140 59.3114 0.2517 86.0306 57.8736 10.3774 20.1718 16.0316 14.0594 67.2651 0.0577 14.1696 2.1970 3.5192 4.1848 2.3203 11.0292 0.9933 0.0066 73.5242 6.7128 1.4462 44.6703 94.1922 0.1502 0.9867 18.5171 5.3121 27.1821 373.2907 237.7459 3.7937 28.7230 355.6971 2.0219 10.9868 3.7430 12.0099 157.0987 47.5359 16.9639 28.0885 94.9430 87.5231 13.5398 14.7763 69.5368 3.6371 2.0954 373.0031 321.2477 71.6809 16.7595 549.5853 9.2037 335.1536 101.9181 43.0753 2.1668 15.9190 16.9322 0.6994 11.7754 8.8088 3.8129 26.3526 20.5667 8.2305 30.5384 82.6389
temp: 298.150 k
press: 1.00000 atm
elementType: 8 8 7 7 6 6 6 6 6 6 6 6 6 6 6 6 6 6 6 6 6 1 1 1 1 1 1 1 1 1 1 1 1 1 1
symmnumber: 1
zpe: 707743.8 jmol-1
zpe.correction: 0.269565 hartree
zpe.thermalcorrener: 0.287195 hartree
zpe.thermalcorrenthalpy: 0.288139 hartree
zpe.thermalcorrgfe: 0.222046 hartree
zpe.sumelectzpe: -914.699125 hartree
zpe.sumelectthermal: -914.681495 hartree
zpe.sumelectthermalent: -914.680551 hartree
zpe.sumelectthermalfe: -914.746644 hartree
dipole: 2.6364 0.3726 0.0085
dipole: 2.6626
quadrupole: -62.6917 -119.1570 -128.5384
quadrupole: 4.3648 -0.0820 0.0048
quadrupole: 40.7707 -15.6946 -25.0760 4.3648 -0.0820 0.0048
hfenergy: -914.96869 hartree
pointgroup: C01 [X(C17H14N2O2)]
dipole: 1.0374396 0.144529 -0.0147224 debye
polarizability: 535.4821009|5.5129225|209.8220375|-5.64294|-5.1725523|83.3051291 unknown
InChI: InChI=1S/C17H14N2O2/c1-21-13-9-6-12(7-10-13)8-11-16(20)17-18-14-4-2-3-5-15(14)19-17/h2-11,18H,1H3
charge 0 multiplicity 1
35 atoms
O  6.629863 -1.38982 -0.055985
O  -0.981052 2.638887 -0.133097
N  -3.434966 1.327439 -0.049297
N  -2.419098 -0.72244 0.012285
C  -4.474219 0.400035 -0.000452
C  -3.81611 -0.886977 0.037733
C  -2.230652 0.617784 -0.040167
C  -5.879797 0.527139 0.015012
C  -4.586632 -2.07423 0.092534
C  -0.944787 1.355988 -0.085527
C  -6.623059 -0.669352 0.069871
C  2.820794 0.48254 -0.095059
C  -5.988252 -1.949397 0.107994
C  0.279439 0.546873 -0.068947
C  1.518461 1.140921 -0.107041
C  2.982358 -0.938334 -0.033975
C  3.999384 1.280275 -0.144758
C  5.414891 -0.701762 -0.073078
C  4.253519 -1.522238 -0.022889
C  5.286749 0.709438 -0.134964
C  7.865421 -0.599369 -0.104674
H  -3.469564 2.346945 -0.086197
H  -6.377705 1.501391 -0.013968
H  -4.093479 -3.050218 0.121655
H  -7.717368 -0.618106 0.083682
H  -6.6112 -2.849242 0.150143
H  0.133283 -0.537548 -0.024987
H  1.522171 2.24103 -0.151036
H  2.100019 -1.58532 0.00559
H  3.898741 2.371426 -0.19177
H  4.384811 -2.60734 0.024019
H  6.166881 1.357556 -0.17478
H  8.678056 -1.339349 -0.08057
H  7.944244 0.072984 0.770878
H  7.924553 -0.007708 -1.038074
