program: Gaussian 09
title: 000209694
version: EM64L-G09RevD.01
frameworkgroup: C1[X(C9H19NO2)]
method: RPBEPBE
basis: SDD
operation: Freq
keyword: #p
keyword: freq=noraman
keyword: PBEPBE/SDD
title: #p freq=noraman PBEPBE/SDD
converged: YES YES NO NO
title: Mulliken charges:
elementType: O O N C C C C C C C C C H H H H H H H H H H H H H H H H H H H
charge: -0.328937 -0.380693 -0.327159 -0.369310 -0.375370 -0.382984 -0.352243 -0.377976 -0.356504 -0.499547 -0.696411 0.298906 0.191439 0.182334 0.196765 0.188240 0.256659 0.181002 0.188109 0.185560 0.205617 0.208040 0.196582 0.194664 0.198924 0.232159 0.208805 0.215094 0.209800 0.331341 0.377093
chargesum: 0.00000
title: Mulliken charges with hydrogens summed into heavy atoms:
elementType: O O N C C C C C C C C C
charge: -0.328937 -0.003600 0.004182 0.004463 0.009635 0.054677 0.021426 0.035680 0.034743 -0.068464 -0.062712 0.298906
polarizability: 1.47755068e+02 -1.16019819e+00 1.05514591e+02 -7.80494750e+00 -1.51937630e+00 9.04349855e+01
1716.lowfreq: -11.4448 -0.0013 -0.0011 -0.0008 0.5744 6.5963 18.4372 27.9159 38.2156
frequency: 17.9606 27.7822 38.0452 65.7762 81.2820 99.1569 129.2437 144.9652 160.7840 181.1111 219.9550 229.0628 250.3457 288.0484 323.2629 381.2667 391.3201 457.4085 482.4450 519.9151 598.5213 698.7215 720.0429 730.3764 763.8142 823.1117 848.6680 889.9690 895.1729 926.7101 976.6423 988.2116 1000.3763 1024.2030 1040.7049 1065.7447 1079.5028 1080.8068 1109.3536 1117.4468 1170.5664 1188.7756 1222.9555 1227.6222 1247.4263 1267.1552 1278.1020 1280.6031 1291.4453 1297.6448 1314.0987 1320.8018 1341.9972 1353.3709 1354.2179 1376.2907 1388.8907 1452.1354 1461.3925 1462.9841 1466.0019 1470.1863 1476.6640 1478.1746 1485.9798 1488.2520 1489.5668 1572.0808 2947.5601 2951.0354 2958.2656 2964.1709 2967.9034 2971.0785 2971.2356 2984.6458 2985.4115 2994.7645 3014.1930 3019.8876 3034.4352 3045.7544 3057.2647 3067.3953 3070.3056 3210.4604 3621.2893
redmass: 6.2698 2.7732 2.3467 3.3042 3.0530 1.7722 2.9227 1.8531 3.4907 4.2443 3.6582 1.1247 2.9522 3.7546 3.0752 1.8496 2.0949 2.7927 2.1336 1.2087 3.2297 2.5749 1.0627 1.1209 1.2369 1.3613 2.0218 1.8770 1.7955 2.1600 2.4628 3.5736 1.4860 3.5854 2.5563 2.8714 2.0906 2.2408 1.6542 2.0262 1.5029 1.6513 1.3339 1.3810 1.2827 1.2645 1.0821 1.1775 1.0971 1.1396 1.3212 1.3568 1.5334 1.6592 1.6821 1.8308 1.2176 1.1319 1.0751 1.0748 1.0705 1.0752 1.0434 1.0749 1.0835 1.9919 1.0963 3.4176 1.0589 1.0588 1.0597 1.0636 1.0585 1.0617 1.0387 1.0705 1.0854 1.0983 1.1009 1.0995 1.1042 1.1005 1.1015 1.1006 1.0993 1.0630 1.0831
irintensity: 1.4440 2.4717 0.8563 1.0043 1.0066 0.3881 0.3230 0.3286 3.3864 1.9873 4.0442 0.0004 25.5918 33.6874 9.3206 37.5227 35.4663 0.0116 41.5339 143.1513 4.6330 6.5632 13.6281 0.0967 3.9101 1.8338 1.2134 4.9281 2.5841 21.9273 45.3145 18.3302 14.6920 14.5567 14.6229 7.5035 1.6643 3.1418 8.9982 11.7625 16.0333 2.8291 8.9408 2.8808 5.4281 1.7486 2.7188 1.3829 1.4894 2.2523 4.7451 29.8705 41.6849 27.4001 25.1528 69.5840 11.4626 23.9701 0.3734 0.0891 2.0858 0.9423 12.1708 1.2000 1.8356 81.0931 30.4819 93.1123 6.8743 3.5872 17.6379 4.2247 68.9802 118.3139 24.4622 26.2050 16.7770 5.4727 6.1124 19.5718 65.0064 26.4206 76.1303 101.5100 56.0278 31.3820 68.1093
temp: 298.150 k
press: 1.00000 atm
elementType: 8 8 7 6 6 6 6 6 6 6 6 6 1 1 1 1 1 1 1 1 1 1 1 1 1 1 1 1 1 1 1
symmnumber: 1
zpe: 711357.4 jmol-1
zpe.correction: 0.270942 hartree
zpe.thermalcorrener: 0.286429 hartree
zpe.thermalcorrenthalpy: 0.287374 hartree
zpe.thermalcorrgfe: 0.225484 hartree
zpe.sumelectzpe: -558.518769 hartree
zpe.sumelectthermal: -558.503281 hartree
zpe.sumelectthermalent: -558.502337 hartree
zpe.sumelectthermalfe: -558.564227 hartree
dipole: 0.2317 3.3333 -0.7195
dipole: 3.4179
quadrupole: -76.7702 -73.9534 -76.8655
quadrupole: 12.1518 -2.3170 0.6287
quadrupole: -0.9072 1.9097 -1.0025 12.1518 -2.3170 0.6287
hfenergy: -558.7897105 hartree
pointgroup: C01 [X(C9H19N1O2)]
dipole: 0.0809878 -1.3264666 0.2053331 debye
polarizability: 146.849207|0.6933861|105.6444916|10.6321609|-0.5417912|91.2109458 unknown
InChI: InChI=1S/C9H19NO2/c1-2-3-4-5-6-7-8-9(11)10-12/h10,12H,2-8H2,1H3
charge 0 multiplicity 1
31 atoms
O  2.738465 1.238177 -0.295867
O  4.999629 1.371249 1.055721
N  4.388395 0.0994 0.773528
C  -1.313372 -0.739333 0.377423
C  -2.426387 0.046887 -0.351853
C  0.072154 -0.583985 -0.288493
C  -3.811798 -0.087028 0.319634
C  1.166953 -1.409517 0.424573
C  -4.925833 0.693352 -0.41516
C  2.583233 -1.25715 -0.20076
C  -6.305582 0.559592 0.265237
C  3.210209 0.10038 0.067153
H  -1.254422 -0.394694 1.431292
H  -1.590664 -1.814471 0.416407
H  -2.14389 1.119073 -0.399988
H  -2.493265 -0.303446 -1.403243
H  0.36951 0.480809 -0.305234
H  0.008311 -0.90758 -1.348783
H  -3.747684 0.270063 1.368986
H  -4.092765 -1.160073 0.373677
H  1.20687 -1.129345 1.496619
H  0.894232 -2.483718 0.3904
H  -4.642547 1.764304 -0.47181
H  -4.991473 0.334149 -1.462609
H  3.250914 -2.055915 0.178726
H  2.51135 -1.385747 -1.297977
H  -6.625677 -0.498882 0.307679
H  -7.083645 1.126378 -0.2788
H  -6.273078 0.940963 1.30346
H  4.922197 -0.679092 1.153824
H  4.33226 1.990501 0.605941
