program: Gaussian 09
title: 000209692
version: EM64L-G09RevD.01
frameworkgroup: C1[X(C11H11NOS2)]
method: RPBEPBE
basis: SDD
operation: Freq
keyword: #p
keyword: freq=noraman
keyword: PBEPBE/SDD
title: #p freq=noraman PBEPBE/SDD
converged: YES YES NO NO
title: Mulliken charges:
elementType: S S O N C C C C C C C C C C C H H H H H H H H H H H
charge: 0.308638 0.154339 -0.183611 -0.209567 -0.556463 0.272354 0.505788 -0.600013 -0.628528 -0.457200 -0.352264 0.476959 -0.199777 -0.429134 -0.808127 0.308694 0.236973 0.253757 0.237367 0.260483 0.247111 0.230362 0.235473 0.233081 0.224403 0.238901
chargesum: 0.00000
title: Mulliken charges with hydrogens summed into heavy atoms:
elementType: S S O N C C C C C C C C C C C
charge: 0.308638 0.154339 -0.183611 -0.209567 -0.247770 0.272354 0.505788 -0.600013 0.099569 -0.196717 -0.105153 0.476959 0.030585 -0.193661 -0.111742
polarizability: 2.06536408e+02 1.23216281e+01 1.64025069e+02 -3.39342316e+00 7.23138222e+00 1.14866968e+02
1716.lowfreq: -7.4640 -0.0022 -0.0017 0.0016 5.5331 9.7000 25.6484 40.6727 46.7759
frequency: 25.3629 40.6315 46.7581 62.9884 72.3996 118.6588 202.2053 210.4014 223.1871 239.0207 257.7031 303.6591 309.9067 335.8894 398.5738 431.2757 437.5591 482.2277 500.5169 515.1536 535.4009 576.2900 636.6045 683.2360 697.9415 710.2386 740.2078 787.3572 848.3874 889.0840 911.1443 925.0741 981.8770 989.0445 996.1956 1007.0247 1011.0722 1050.5359 1066.6053 1074.3054 1098.6202 1148.6606 1180.6081 1198.6406 1219.1815 1232.8064 1276.2367 1301.5174 1307.2921 1382.2613 1390.5818 1399.4844 1433.3147 1466.3510 1470.5550 1473.2365 1474.2700 1484.6108 1598.3096 1620.4940 1638.2499 2980.2908 2997.8549 3043.9465 3059.6973 3088.8152 3099.8257 3109.4307 3129.1119 3146.9283 3150.3415 3171.2228
redmass: 3.9515 1.0490 4.7955 6.9500 6.5446 6.5279 4.6339 3.4516 1.0728 3.7794 5.0692 3.8935 6.2311 4.9074 14.4662 4.8294 2.9170 5.4071 14.7296 5.1080 6.7070 5.8256 6.9363 3.7292 2.3733 4.4563 5.7662 1.5535 3.4748 1.3629 1.8506 2.1589 1.3710 3.5833 1.8258 3.6472 1.8065 1.5658 2.1661 2.1894 1.5728 2.1637 1.0972 1.4138 4.2233 3.9865 1.3603 1.9458 2.5323 6.2670 1.1823 1.2716 2.7471 1.0455 1.0458 1.0493 1.6066 1.5981 6.0814 6.6611 11.9352 1.0373 1.0348 1.0844 1.0978 1.0989 1.1003 1.1014 1.0879 1.0926 1.0923 1.0988
irintensity: 0.4330 0.2946 3.1381 0.2535 2.0587 1.1233 0.7458 1.9763 0.4527 3.4008 4.1823 0.9090 1.2713 3.3937 2.7174 4.3082 3.2907 14.4509 4.4540 0.7316 4.7026 6.7066 17.3947 4.7983 11.8524 9.9807 34.9093 26.5117 2.4008 2.4013 5.2142 9.3166 0.2932 5.6839 12.8749 22.0076 9.6080 8.4188 22.7555 17.6545 15.2369 9.7050 0.6193 12.9627 296.3733 234.3685 4.5912 35.5164 71.3008 0.8439 16.7675 16.0472 6.0858 20.9283 14.9036 7.9097 10.3163 41.7175 7.2136 27.8076 200.5883 28.5331 18.7811 2.3540 16.1739 19.0818 8.0879 16.7106 8.9030 8.4958 16.4808 8.1180
temp: 298.150 k
press: 1.00000 atm
elementType: 16 16 8 7 6 6 6 6 6 6 6 6 6 6 6 1 1 1 1 1 1 1 1 1 1 1
symmnumber: 1
zpe: 509037.7 jmol-1
zpe.correction: 0.193882 hartree
zpe.thermalcorrener: 0.208682 hartree
zpe.thermalcorrenthalpy: 0.209626 hartree
zpe.thermalcorrgfe: 0.149831 hartree
zpe.sumelectzpe: -1350.807251 hartree
zpe.sumelectthermal: -1350.792451 hartree
zpe.sumelectthermalent: -1350.791506 hartree
zpe.sumelectthermalfe: -1350.851302 hartree
dipole: 0.2035 -1.5494 0.8402
dipole: 1.7743
quadrupole: -83.6550 -116.9412 -96.7886
quadrupole: 5.5116 -0.0924 5.4281
quadrupole: 15.4733 -17.8130 2.3397 5.5116 -0.0924 5.4281
hfenergy: -1351.0011327 hartree
pointgroup: C01 [X(C11H11N1O1S2)]
dipole: 0.0277493 -0.464857 0.5200175 debye
dipolederiv: -0.6998926 -0.1120822 0.122214 -0.0825257 -0.0761298 0.0776945 0.1389472 0.0561283 -0.0594544 -0.4983199 -0.271918 0.1887861 -0.273212 -0.5564937 0.2694125 0.1199656 0.2406049 -0.2269803 -0.4719103 0.1845692 -0.0774852 -0.1088965 -1.0209717 0.3425959 0.0964877 0.3350035 -0.4456819 -0.8750345 -0.2428082 0.1716994 0.0578598 -1.3162899 0.5909534 0.0159492 0.5850096 -0.3363906 -0.3433188 0.1286826 -0.0151106 0.0868118 0.2854588 -0.1101549 -0.031043 -0.0738442 0.1838733 0.8826021 0.263551 -0.1946212 0.4538526 1.2645111 -0.5406898 -0.1803419 -0.5431729 0.4058438 0.6660509 -0.1836182 0.0888396 -0.1176739 0.0790089 0.1191415 0.0287254 0.0634145 0.1358311 1.2834149 0.1564309 -0.1999105 0.0392377 1.2184776 -0.7343848 -0.1474175 -0.6409516 0.1528072 0.0668138 0.0184398 0.0128179 -0.0744476 -0.0451352 0.0885937 -0.0395104 0.0129336 0.0034053 -0.193471 -0.1234123 -0.1199181 -0.0396462 -0.0364047 0.0359064 0.0149669 -0.0276926 -0.1094187 -0.1172276 0.0863424 0.0386896 0.0210903 -0.0616817 0.0265963 -0.0574716 0.0306962 -0.095453 0.1110043 0.1953194 0.1677315 0.1895635 0.112584 0.149061 0.1719286 0.1265297 0.1285114 -0.0167575 -0.0828254 -0.0430794 -0.0362842 0.030933 0.1197408 -0.014461 0.1040635 -0.0413461 0.0656168 -0.0377465 0.0068486 -0.1153727 -0.1292867 -0.0008456 -0.047233 0.0238424 -0.1631008 0.0361748 -0.0434812 -0.0385536 -0.10328 -0.0478824 -0.1000861 -0.0731874 -0.0765585 -0.0220075 0.0586375 -0.0116516 -0.0162157 -0.0531723 -0.0361748 -0.0196607 0.0017235 -0.0203289 -0.0006445 -0.1193165 0.0344188 0.0101201 0.0802642 0.1091315 -0.0064466 -0.0284771 0.0115327 0.0704159 0.105622 0.0194507 0.0117576 -0.0279788 -0.0552331 0.0754088 0.0624086 0.0739431 0.0390975 0.0572634 -0.0719775 -0.0711566 -0.0351087 0.0228445 -0.1048075 -0.0340864 -0.0578447 0.0086092 0.0835968 0.0418282 0.0343561 0.0624602 0.0173571 -0.0740784 0.0531521 -0.0544874 0.0727361 0.0285579 -0.0637639 -0.0706578 -0.0583349 0.0813935 -0.0686295 -0.0652211 -0.0393795 0.0730572 0.0373814 0.0640308 0.0287 0.0705793 -0.0034978 -0.1138347 0.033838 -0.1115413 0.0652692 -0.1254987 0.045978 -0.0206078 0.0285492 0.1098571 -0.0294594 -0.03098 -0.0212257 0.1251327 0.0463241 -0.0282999 0.069833 -0.0255403 0.0972002 -0.00199 -0.0019229 -0.0317008 -0.1286877 -0.1401772 0.0291499 -0.0345368 0.1114119 0.0673094 -0.0096006 0.0303513 -0.0281782 0.0927734 0.0718638 0.0053932 -0.05054 -0.0502069 -0.1108853 0.0195637 -0.0170908 0.0632043 0.0718018 unknown
polarizability: 208.1497838|8.3459397|161.9209896|-3.3649653|-9.3033775|115.3576717 unknown
InChI: InChI=1S/C11H11NOS2/c1-7-4-3-5-9(6-7)12-10(13)8(2)15-11(12)14/h3-6,8H,1-2H3
charge 0 multiplicity 1
26 atoms
S  -3.13005 1.253683 -0.840298
S  -0.435313 2.518034 -1.6081
O  -1.385618 -2.041536 0.542442
N  -0.794978 0.036138 -0.4244
C  -3.179033 -0.483215 -0.067142
C  -1.719895 -0.936184 0.057004
C  0.634296 -0.237552 -0.37312
C  -1.306683 1.242595 -0.949828
C  -3.905423 -0.512901 1.29034
C  1.461709 0.546916 0.454396
C  1.158444 -1.29811 -1.142258
C  2.853763 0.289985 0.521808
C  2.54163 -1.564062 -1.072433
C  3.379967 -0.775803 -0.251325
C  3.749821 1.144571 1.400696
H  -3.68345 -1.146314 -0.791665
H  -4.966991 -0.238219 1.171086
H  -3.849038 -1.533551 1.708652
H  -3.441029 0.187322 2.004964
H  1.024958 1.363938 1.038698
H  0.499158 -1.901121 -1.773632
H  2.96654 -2.38451 -1.660228
H  4.454459 -0.9895 -0.209189
H  3.4194 1.121786 2.455853
H  4.796561 0.797771 1.367383
H  3.734096 2.202141 1.077194
