program: Gaussian 09
title: 000209769
version: EM64L-G09RevD.01
frameworkgroup: C1[X(C26H24N2O3)]
method: RPBEPBE
basis: SDD
operation: Freq
keyword: #p
keyword: freq=noraman
keyword: PBEPBE/SDD
title: #p freq=noraman PBEPBE/SDD
converged: YES YES NO NO
title: Mulliken charges:
elementType: O O O N N C C C C C C C C C C C C C C C C C C C C C C C C C C H H H H H H H H H H H H H H H H H H H H H H H H
charge: -0.201610 -0.203701 -0.217194 -0.249335 -0.240351 -0.337066 -0.404691 0.106562 0.112953 -0.528146 0.460548 0.458377 0.097557 0.319320 -0.378818 -0.374590 -0.353308 -0.357288 -0.537038 -0.374310 0.325692 -0.213008 -0.211622 -0.205576 -0.211255 0.329005 -0.417402 -0.248910 -0.249045 -0.819349 -0.807217 0.292795 0.250847 0.260966 0.243777 0.258540 0.281125 0.280842 0.264958 0.265568 0.246541 0.277442 0.231475 0.232303 0.230881 0.230947 0.235601 0.232644 0.232947 0.228646 0.226642 0.233691 0.229802 0.233084 0.228747
chargesum: 0.00000
title: Mulliken charges with hydrogens summed into heavy atoms:
elementType: O O O N N C C C C C C C C C C C C C C C C C C C C C C C C C C
charge: -0.201610 -0.203701 -0.217194 -0.249335 -0.240351 -0.044271 0.107122 0.106562 0.112953 -0.025829 0.460548 0.458377 0.097557 0.319320 -0.097694 -0.093747 -0.088350 -0.091720 -0.290497 -0.096868 0.325692 0.018467 0.020681 0.025305 0.019692 0.329005 -0.181800 -0.016266 -0.016097 -0.130369 -0.115583
polarizability: 3.18766809e+02 -1.29408122e+01 3.24769640e+02 8.37299267e+00 -1.03816018e+01 2.61208497e+02
1716.lowfreq: -6.3568 -0.0010 -0.0008 -0.0006 2.3914 3.4043 9.1373 12.0267 19.9290
frequency: 7.8943 11.9483 19.8983 35.9926 48.5314 52.0747 58.6958 60.0798 73.2013 81.8646 92.2512 107.9514 119.9385 128.3564 131.1882 161.8906 195.8125 209.9754 211.0071 213.7251 248.0386 266.5098 286.9772 290.2062 291.1870 301.7679 335.6621 368.9003 379.7556 385.8600 404.9786 406.5968 421.6115 435.0970 468.5996 485.9529 493.2169 502.5002 508.8064 528.4318 566.7714 588.5921 603.8246 611.5325 613.5194 620.0823 635.0808 655.7325 681.1787 692.4001 697.6186 727.4058 731.2256 741.0289 758.1463 761.6971 792.4974 801.8911 837.0506 837.8851 851.5822 853.0526 867.5592 892.2566 903.8279 910.4568 911.5923 936.6744 969.7654 971.0617 972.4620 986.8112 987.8091 990.3659 992.8469 993.4360 995.4274 999.4026 1024.3039 1024.8201 1030.9918 1037.8532 1043.9714 1054.1686 1071.9486 1086.5894 1092.9406 1120.4983 1125.6002 1135.8977 1171.5761 1172.5703 1174.4001 1174.8294 1186.3976 1189.6038 1190.3722 1212.1250 1230.2067 1232.5821 1255.2325 1283.9422 1286.1280 1287.5487 1299.4735 1317.2217 1322.6594 1335.8161 1361.3761 1376.7231 1382.9300 1385.4691 1394.4883 1398.6715 1408.1114 1436.4129 1442.8482 1447.6615 1454.0812 1462.1258 1468.3151 1475.5135 1477.9443 1478.8708 1482.3584 1497.9430 1562.1406 1591.4532 1593.7105 1597.1159 1603.8246 1608.1251 1619.4059 1636.1870 1665.6840 2963.1111 2969.9335 2971.4680 3013.1222 3017.9423 3032.7199 3041.6593 3045.3503 3082.3993 3088.9129 3095.5352 3126.3766 3129.9049 3133.1121 3133.7521 3144.3769 3144.7516 3160.5831 3160.9930 3161.4043 3172.0000 3172.7645 3191.4104 3191.7553
redmass: 5.6344 5.2656 4.3067 5.5995 4.1522 5.8338 5.5687 3.8980 6.2740 7.0567 3.9995 1.1446 2.1699 6.3595 4.5149 1.1124 2.5483 2.9415 5.2526 4.7635 5.1589 4.9061 3.5623 3.4159 6.8825 3.7300 7.5243 6.7340 4.6622 8.6789 2.9145 2.8973 5.5109 2.6978 5.6388 4.3348 3.0244 3.4750 3.8800 4.0537 7.9586 5.2650 2.4279 6.3795 6.2072 6.2140 7.1994 6.3130 3.2388 2.2036 2.0184 2.7175 5.4536 4.2918 1.6441 1.6452 1.8573 5.3064 1.2580 1.2570 1.3776 7.0938 4.2297 1.4567 4.3828 1.4351 1.3938 3.0545 1.5331 1.3923 2.2955 5.9890 5.2750 1.3671 1.3161 1.3202 1.6294 1.8879 2.3562 2.3734 1.4649 2.0635 2.0702 1.6683 2.3213 1.7126 2.4523 3.0441 1.8019 2.3246 1.4280 1.3946 1.0515 1.0786 1.7139 1.1256 1.1480 3.9777 2.1717 1.5716 3.2598 2.7528 1.5147 3.4126 1.3458 1.7052 1.3409 1.5138 1.6985 5.4189 8.7307 10.4035 1.2544 2.6851 1.3634 1.1121 2.3181 2.3556 1.0937 1.0474 1.1725 1.0507 1.1740 2.2867 2.2931 2.4173 6.8664 6.4154 6.6112 8.2357 6.1392 5.9967 6.2623 12.0387 11.9157 1.0605 1.0375 1.0384 1.0797 1.0974 1.0628 1.0968 1.0968 1.0986 1.0980 1.1039 1.0893 1.0906 1.0854 1.0853 1.0900 1.0900 1.0952 1.0946 1.0946 1.0983 1.0983 1.0962 1.0962
irintensity: 0.2363 0.5576 0.1706 0.6560 1.1594 1.6829 1.7320 0.4788 0.7503 2.1005 0.6704 0.0459 1.7566 3.0750 0.7906 1.8359 0.6703 2.6615 2.4597 5.0728 7.5733 0.7355 0.4615 3.2065 6.5784 2.8691 4.2084 2.5639 13.0401 3.3491 2.0228 0.6805 9.6587 4.9262 19.7427 2.5786 0.5490 4.7132 13.2007 0.5969 17.8900 0.5990 1.4328 0.9941 0.3308 3.7336 8.7388 0.5633 3.1435 14.6047 71.0543 4.0766 5.5195 0.7930 81.6243 56.3447 18.2817 20.5737 1.0954 2.1071 21.6843 0.0907 14.6872 2.6292 0.5561 5.0003 3.9800 6.5083 5.9708 1.2783 26.5428 0.4427 0.4147 2.9261 0.1157 0.2094 0.6710 2.7676 8.8305 4.5283 12.5759 32.5171 2.8343 0.0391 1.3047 11.9818 14.2890 23.8719 48.5694 9.7470 5.8694 15.9004 0.0925 1.2185 4.2381 1.8129 1.9361 153.3627 70.6758 1.0809 67.2097 125.9741 27.7630 217.7958 7.8314 140.2556 1.7755 2.6920 44.3100 5.7107 2.6366 0.5397 2.7979 4.3362 14.1481 7.4526 7.6140 14.6075 37.6935 0.3520 32.4733 26.6303 1.6039 58.6463 94.9913 1.0608 132.7805 3.6832 6.8104 65.9804 10.4597 60.1774 28.4471 299.3923 202.9912 18.5487 45.5594 10.9642 5.3823 5.8831 9.8131 36.2824 0.0994 26.5341 14.8846 5.9876 27.1210 6.6587 0.3092 0.3196 12.8026 12.5360 8.3101 33.6919 23.1792 7.6147 9.5483 1.0250 0.9350
temp: 298.150 k
press: 1.00000 atm
elementType: 8 8 8 7 7 6 6 6 6 6 6 6 6 6 6 6 6 6 6 6 6 6 6 6 6 6 6 6 6 6 6 1 1 1 1 1 1 1 1 1 1 1 1 1 1 1 1 1 1 1 1 1 1 1 1
symmnumber: 1
zpe: 1140050.6 jmol-1
zpe.correction: 0.434222 hartree
zpe.thermalcorrener: 0.462380 hartree
zpe.thermalcorrenthalpy: 0.463324 hartree
zpe.thermalcorrgfe: 0.371235 hartree
zpe.sumelectzpe: -1338.161142 hartree
zpe.sumelectthermal: -1338.132984 hartree
zpe.sumelectthermalent: -1338.132040 hartree
zpe.sumelectthermalfe: -1338.224129 hartree
dipole: -0.8592 6.4303 -2.3976
dipole: 6.9163
quadrupole: -157.7115 -184.6749 -181.9518
quadrupole: 7.7273 -8.0555 -2.8665
quadrupole: 17.0679 -9.8955 -7.1724 7.7273 -8.0555 -2.8665
hfenergy: -1338.5953644 hartree
pointgroup: C01 [X(C26H24N2O3)]
dipole: -0.4306907 2.4275222 -1.1514785 debye
polarizability: 319.8487504|-12.5790615|321.8019269|8.6751348|-15.2134162|263.0942689 unknown
InChI: InChI=1S/C26H24N2O3/c1-18-13-14-20(17-19(18)2)24(29)16-15-23-25(30)27(21-9-5-3-6-10-21)28(26(23)31)22-11-7-4-8-12-22/h3-14,17,23H,15-16H2,1-2H3
charge 0 multiplicity 1
55 atoms
O  -1.613713 -3.164922 -0.741984
O  -0.772447 -0.440227 3.18287
O  3.366268 -2.936902 0.986979
N  -2.190572 -0.975143 -0.034244
N  -1.94451 -0.164119 1.139656
C  -0.881114 -2.265923 1.474657
C  0.642805 -2.56496 1.427874
C  -1.556025 -2.237749 0.102493
C  -1.18522 -0.899389 2.08939
C  1.444688 -1.467302 0.70571
C  -3.33779 -0.716584 -0.865214
C  -1.934065 1.272336 1.034193
C  2.933414 -1.817417 0.579597
C  3.856385 -0.813944 -0.044544
C  -3.331675 -1.190926 -2.201225
C  -2.134435 2.042961 2.206679
C  -4.463073 -0.023576 -0.352729
C  -1.694705 1.905983 -0.211569
C  3.422079 0.47143 -0.466371
C  5.221319 -1.161419 -0.220045
C  4.309417 1.40457 -1.048595
C  -4.463733 -0.973998 -3.015704
C  -2.082472 3.451058 2.124613
C  -5.579571 0.197519 -1.185932
C  -1.662365 3.314723 -0.277942
C  5.682276 1.042836 -1.222657
C  6.112497 -0.242745 -0.802237
C  -5.588228 -0.276226 -2.518184
C  -1.852663 4.094173 0.886615
C  3.807286 2.771285 -1.477965
C  6.667977 2.013399 -1.843774
H  -1.366837 -3.066237 2.066015
H  1.01175 -2.674173 2.462225
H  0.790366 -3.535851 0.924411
H  1.045689 -1.296914 -0.316363
H  1.348053 -0.503685 1.244701
H  -2.466121 -1.737598 -2.581113
H  -2.307538 1.544313 3.162623
H  -4.467044 0.334091 0.680617
H  -1.54207 1.307705 -1.114178
H  2.373972 0.765097 -0.33782
H  5.552209 -2.152352 0.107579
H  -4.460748 -1.349157 -4.044758
H  -2.229853 4.04463 3.033216
H  -6.446242 0.736725 -0.788455
H  -1.487124 3.802199 -1.243251
H  7.164999 -0.519358 -0.935671
H  -6.459278 -0.103857 -3.15915
H  -1.825662 5.187463 0.829137
H  4.346054 3.585208 -0.955835
H  3.954878 2.938012 -2.562495
H  2.731835 2.888677 -1.261549
H  6.740631 2.949191 -1.256463
H  7.67746 1.573848 -1.905959
H  6.360686 2.30572 -2.866476
