program: Gaussian 09
title: 000209699
version: EM64L-G09RevD.01
frameworkgroup: C1[X(C12H27O3PS)]
method: RPBEPBE
basis: SDD
operation: Freq
keyword: #p
keyword: freq=noraman
keyword: PBEPBE/SDD
title: #p freq=noraman PBEPBE/SDD
converged: YES YES NO NO
title: Mulliken charges:
elementType: S P O O O C C C C C C C C C C C C H H H H H H H H H H H H H H H H H H H H H H H H H H H
charge: -0.281648 0.906100 -0.496142 -0.472965 -0.477035 -0.368545 -0.394496 -0.367360 0.032342 -0.354606 -0.356018 -0.692868 -0.695904 -0.214117 -0.212922 -0.654758 -0.654645 0.213881 0.190581 0.192366 0.216228 0.184530 0.192424 0.229492 0.188814 0.187570 0.194772 0.195331 0.227588 0.208932 0.239751 0.210157 0.209394 0.215492 0.228314 0.228029 0.220422 0.231013 0.230083 0.235993 0.209243 0.230052 0.235623 0.209513
chargesum: 0.00000
title: Mulliken charges with hydrogens summed into heavy atoms:
elementType: S P O O O C C C C C C C C C C C C
charge: -0.281648 0.906100 -0.496142 -0.472965 -0.477035 0.035917 0.014098 0.009594 0.261834 0.021778 0.034085 -0.016597 -0.060862 0.242226 0.238513 0.020561 0.020543
polarizability: 2.12891324e+02 -5.65546713e+00 1.81853812e+02 -1.26466838e+00 9.96961676e-01 1.65390228e+02
1716.lowfreq: -12.1747 -4.7279 -0.0001 0.0015 0.0026 6.8592 13.8254 19.1134 20.8993
frequency: 12.2557 13.7214 20.2540 28.9628 36.8074 45.9960 47.3976 61.4076 73.4159 88.8022 101.2031 104.6469 118.6607 132.6951 152.1401 172.6906 189.3476 210.5383 218.1376 225.8697 237.8790 246.5604 257.6556 265.0234 284.3051 292.7425 341.5717 349.7789 398.8833 426.3664 440.0775 484.8614 500.1071 510.2705 678.6674 694.9361 704.5894 721.6787 739.5734 787.2893 808.5200 811.1462 840.9711 871.9812 873.5971 882.0060 886.5511 914.2939 959.5822 995.2954 1008.5636 1017.9413 1026.9809 1033.3970 1068.9180 1079.3123 1085.4366 1104.9370 1106.2803 1121.1831 1131.4376 1134.3663 1135.8797 1169.0474 1197.1852 1229.7662 1246.1466 1253.7571 1256.8342 1276.0829 1279.2275 1286.2823 1292.6646 1316.9494 1336.5667 1346.8829 1352.7908 1355.5328 1359.8232 1362.8727 1388.6619 1389.9365 1394.6904 1394.9132 1445.6550 1456.9657 1458.1506 1461.7735 1462.6191 1464.5099 1472.7008 1473.4385 1477.0885 1477.6749 1478.4254 1481.8470 1487.5750 1488.6841 1489.0797 2950.8244 2955.5380 2966.1525 2968.9229 2971.6658 2972.2989 2976.9635 2984.3838 2987.6465 2987.9068 2988.7493 2995.4674 2995.8945 3003.9717 3020.7761 3032.1541 3048.5822 3051.2073 3054.7430 3068.4769 3070.4331 3085.5288 3091.9161 3092.1657 3097.4507 3109.6576 3109.8561
redmass: 2.6791 2.8822 3.2125 3.5661 2.4493 1.7465 2.3865 2.9908 3.3103 3.2816 4.9731 3.8113 1.9509 2.5183 3.0257 2.6832 1.2641 2.1037 1.9047 2.0947 1.1402 1.8428 1.9636 3.9742 3.7065 3.7954 5.8100 3.6131 3.4703 3.9866 4.9124 2.9149 4.2922 4.5703 3.6101 6.0198 6.7839 1.0768 1.1720 1.2641 1.0934 1.0920 6.2020 1.2800 4.4536 3.0084 2.1530 1.9624 1.2915 2.4678 1.7571 2.4983 2.6623 2.8273 2.3300 2.1689 2.0197 2.2293 2.2054 1.8895 2.5048 1.4305 1.4338 2.1275 1.5948 1.3118 1.3266 1.1443 1.1380 1.2782 1.1094 1.1148 1.0934 1.3255 1.1981 1.4138 1.2695 1.6279 1.2475 1.6771 1.2169 1.2225 1.2464 1.2464 1.0805 1.0401 1.0402 1.0527 1.0663 1.0743 1.0663 1.0586 1.0548 1.0427 1.0511 1.0781 1.0791 1.0874 1.0805 1.0588 1.0589 1.0606 1.0599 1.0368 1.0745 1.0710 1.0550 1.0878 1.0441 1.0540 1.0373 1.0385 1.0991 1.0994 1.1035 1.1083 1.1033 1.1077 1.1006 1.0993 1.0988 1.0981 1.0981 1.1005 1.1021 1.1022
irintensity: 0.7340 0.1179 0.1134 1.3773 0.9476 0.3988 1.1230 1.9829 3.9858 0.7388 1.3663 1.5771 0.1924 0.2329 0.6789 0.0748 1.4480 5.7597 3.9942 0.6825 0.0554 5.4564 6.8850 1.9350 5.4985 1.5241 10.4009 3.7510 4.8626 5.9147 10.3581 1.1202 6.8314 16.6120 58.5582 89.2998 118.9964 17.8553 4.4163 8.2390 1.5085 2.5878 296.6174 8.2476 244.2202 71.3771 7.3983 22.1917 2.5815 27.6127 15.3235 151.1560 51.2679 1.7825 8.6807 25.5101 12.5930 11.0991 5.3467 10.3866 9.9543 4.4417 4.5994 10.5486 3.2592 5.8628 0.8314 0.4974 0.8636 0.3747 1.0199 0.6769 1.7695 0.5782 13.1450 3.5203 6.8792 1.5486 5.1164 6.4451 11.1157 19.6710 26.3247 30.3187 2.7510 11.4580 12.3169 9.1218 1.0293 1.0090 1.5367 10.1032 5.6382 12.2842 6.2993 1.6906 14.1334 12.8473 14.2792 1.4469 12.1760 6.6198 64.4369 35.6345 48.0136 39.7348 29.3520 2.2509 30.2986 21.1587 28.5854 21.9631 4.0235 7.2339 23.5670 16.6193 86.2715 12.8418 95.1521 56.8049 35.8270 25.9397 28.4694 22.2303 34.4665 32.2919
temp: 298.150 k
press: 1.00000 atm
elementType: 16 15 8 8 8 6 6 6 6 6 6 6 6 6 6 6 6 1 1 1 1 1 1 1 1 1 1 1 1 1 1 1 1 1 1 1 1 1 1 1 1 1 1 1
symmnumber: 1
zpe: 990020.4 jmol-1
zpe.correction: 0.377079 hartree
zpe.thermalcorrener: 0.401642 hartree
zpe.thermalcorrenthalpy: 0.402587 hartree
zpe.thermalcorrgfe: 0.316904 hartree
zpe.sumelectzpe: -1437.009146 hartree
zpe.sumelectthermal: -1436.984582 hartree
zpe.sumelectthermalent: -1436.983638 hartree
zpe.sumelectthermalfe: -1437.069321 hartree
dipole: -0.3152 0.1885 -0.7862
dipole: 0.8677
quadrupole: -110.9601 -111.4934 -131.2285
quadrupole: 1.4420 -2.2255 -1.3511
quadrupole: 6.9339 6.4006 -13.3345 1.4420 -2.2255 -1.3511
hfenergy: -1437.3862246 hartree
pointgroup: C01 [X(C12H27O3P1S1)]
dipole: -0.1130202 0.1006833 -0.3059956 debye
polarizability: 212.818173|-5.9697543|181.7139424|-0.1746706|2.156741|165.6032489 unknown
InChI: InChI=1S/C12H27O3PS/c1-5-8-9-10-11-12(4)15-16(17,13-6-2)14-7-3/h12H,5-11H2,1-4H3
charge 0 multiplicity 1
44 atoms
S  2.008751 0.025528 2.439998
P  2.04508 0.166545 0.369335
O  0.778963 -0.601357 -0.502485
O  3.433927 -0.448391 -0.447559
O  1.992548 1.752696 -0.31066
C  -2.147648 -0.813361 0.020384
C  -1.239039 -1.933184 -0.529474
C  -3.60265 -0.920935 -0.488121
C  0.197719 -1.895908 0.010857
C  -4.519382 0.200539 0.050116
C  -5.981866 0.082613 -0.436809
C  1.073704 -3.061332 -0.463186
C  -6.890675 1.206367 0.106649
C  4.780657 -0.014033 0.036802
C  1.003919 2.726243 0.2425
C  5.796586 -0.846091 -0.739142
C  1.326258 4.070698 -0.401901
H  -1.723464 0.167545 -0.269219
H  -2.143636 -0.84584 1.129952
H  -1.665176 -2.923548 -0.267066
H  -1.201784 -1.883339 -1.635628
H  -4.022492 -1.907032 -0.197035
H  -3.607412 -0.89683 -1.598116
H  0.191338 -1.834987 1.119785
H  -4.502544 0.187431 1.160233
H  -4.111304 1.187046 -0.254686
H  -6.387731 -0.903507 -0.131444
H  -5.999068 0.09532 -1.545945
H  1.106824 -3.095428 -1.566121
H  0.662981 -4.018289 -0.091225
H  2.107943 -2.958956 -0.091159
H  -6.914855 1.196269 1.212839
H  -6.523635 2.200858 -0.210672
H  -7.929976 1.0989 -0.254945
H  4.891561 1.067397 -0.165703
H  4.843118 -0.191413 1.128072
H  -0.014436 2.379705 -0.017667
H  1.107552 2.756398 1.344466
H  5.65481 -1.921642 -0.538879
H  5.69336 -0.674471 -1.823781
H  6.821412 -0.563532 -0.434703
H  2.348747 4.393189 -0.141877
H  1.247361 4.005739 -1.500148
H  0.614354 4.837081 -0.043234
