program: Gaussian 09
title: 000209683
version: EM64L-G09RevD.01
frameworkgroup: C1[X(C17H19ClO)]
method: RPBEPBE
basis: SDD
operation: Freq
keyword: #p
keyword: freq=noraman
keyword: PBEPBE/SDD
title: #p freq=noraman PBEPBE/SDD
converged: YES YES NO NO
title: Mulliken charges:
elementType: Cl O C C C C C C C C C C C C C C C C C H H H H H H H H H H H H H H H H H H H
charge: -0.071410 -0.453542 0.119845 0.530974 -0.696654 -0.747060 -0.699372 -0.565062 0.358636 -0.414123 -0.720082 0.118896 -0.413857 0.522393 -0.364273 -0.438498 -0.213214 -0.206846 -0.107964 0.206360 0.223693 0.218177 0.216088 0.217738 0.214782 0.207983 0.215417 0.221901 0.231666 0.249292 0.213987 0.253340 0.214223 0.266321 0.231101 0.356994 0.250449 0.251699
chargesum: 0.00000
title: Mulliken charges with hydrogens summed into heavy atoms:
elementType: Cl O C C C C C C C C C C C C C C C C C
charge: -0.071410 -0.096547 0.119845 0.530974 -0.048423 -0.098452 -0.054071 -0.333396 0.358636 -0.164832 -0.252755 0.118896 -0.199635 0.522393 -0.097951 -0.207396 0.037235 0.044853 -0.107964
polarizability: 2.35346775e+02 -9.11028103e+00 1.90858668e+02 -2.69120097e+00 -1.85370750e+01 1.54284628e+02
1716.lowfreq: -4.8871 -0.0018 0.0012 0.0016 1.4837 10.7829 18.4202 21.2257 30.3474
frequency: 16.4239 21.0282 29.6113 53.9015 92.0116 103.5829 151.9740 171.4532 201.0301 203.7655 247.3118 262.6879 278.7047 285.4119 293.8720 315.3483 325.6477 352.3728 357.8434 365.6092 379.7597 407.7729 409.6768 430.3656 453.6184 474.6622 496.2287 505.4177 574.3241 605.4588 628.4019 650.9812 657.5133 712.9080 732.4810 768.8769 793.6123 804.2136 813.1841 829.3148 840.9233 905.1564 912.5077 919.9172 928.5184 934.4536 934.5931 943.6028 957.3168 970.4746 1000.2729 1018.4454 1026.5203 1070.8062 1073.5842 1103.1302 1115.0862 1158.6287 1180.3270 1182.7357 1197.5864 1205.6297 1209.6773 1214.7890 1243.4739 1274.6598 1293.5329 1306.4674 1313.5098 1374.3857 1376.1965 1377.3083 1379.3872 1396.5052 1403.7646 1417.4487 1459.8679 1463.4930 1465.9349 1468.8521 1477.6535 1479.6863 1487.1286 1495.5738 1501.4319 1587.9818 1598.3623 1606.2744 1616.2985 2971.3295 2972.2751 2977.6613 3002.5441 3059.7979 3066.0049 3067.6146 3069.2073 3075.9399 3078.0123 3081.3412 3107.8707 3116.7902 3124.9728 3143.4381 3165.8557 3165.9054 3169.3559 3583.2704
redmass: 3.9338 5.2912 3.1419 5.5147 4.2905 6.2222 4.4671 3.2566 1.6563 2.2235 1.1008 3.4177 3.3683 3.9513 3.7925 1.0745 3.1785 2.0867 1.2686 2.5341 4.5142 3.0209 3.0456 3.6167 3.2530 3.2991 3.0857 2.9527 3.7021 5.4702 6.7786 5.1628 4.1282 3.7832 4.3388 3.8119 2.7082 1.4856 3.0463 1.2986 1.8055 1.9868 2.2720 1.6405 1.7137 1.4416 1.5344 1.2126 1.5625 1.3746 4.5305 1.4122 1.3833 2.6301 2.3296 1.3877 1.8903 1.2007 1.1789 1.1942 2.1220 2.9596 2.0830 2.8904 2.5669 2.9911 1.3371 1.4086 1.3810 1.3481 1.2904 3.7812 5.5378 2.7419 1.2041 3.4839 1.0505 1.0513 1.1897 1.0948 1.8931 1.1159 1.0513 1.1900 2.0278 7.4724 6.3106 6.4980 6.6593 1.0348 1.0349 1.0359 1.0598 1.1020 1.1000 1.0999 1.1004 1.0985 1.0994 1.0990 1.0897 1.0902 1.0899 1.0892 1.0927 1.0952 1.0965 1.0660
irintensity: 0.0112 0.1808 0.0375 0.0465 0.4030 0.3861 1.5521 0.7828 0.8330 0.7374 0.0859 2.0739 0.3387 1.1718 0.4765 0.1737 0.4923 10.2277 121.2417 3.3649 3.3190 3.1789 2.2835 1.5021 15.9929 3.9556 9.3574 5.7132 22.7400 3.6746 0.4627 5.6248 18.9486 6.9900 3.8576 4.6985 27.6599 49.1029 15.4150 1.9141 31.8877 6.9943 2.1586 5.6180 2.9723 1.6281 2.4905 0.7319 2.6310 0.8129 43.1593 0.5948 0.1485 50.9640 66.9206 56.6846 57.6821 34.3515 1.2345 2.4440 2.6029 6.4982 0.8592 1.9914 19.4806 78.5294 0.6454 1.7337 11.6188 19.2963 16.9377 4.3280 23.5637 7.6627 8.5183 5.1040 0.0018 0.1343 29.3180 7.2723 69.6159 31.3040 11.2992 0.4347 93.9166 1.2349 2.3767 1.0557 5.9059 31.8943 32.2968 30.1328 24.3291 4.8983 4.6809 4.2299 19.6105 119.1392 37.1573 47.5949 23.8078 11.0653 14.0285 1.0529 11.0877 9.1285 1.1809 33.1109
temp: 298.150 k
press: 1.00000 atm
elementType: 17 8 6 6 6 6 6 6 6 6 6 6 6 6 6 6 6 6 6 1 1 1 1 1 1 1 1 1 1 1 1 1 1 1 1 1 1 1
symmnumber: 1
zpe: 814222.7 jmol-1
zpe.correction: 0.310121 hartree
zpe.thermalcorrener: 0.328925 hartree
zpe.thermalcorrenthalpy: 0.329869 hartree
zpe.thermalcorrgfe: 0.261295 hartree
zpe.sumelectzpe: -1193.109319 hartree
zpe.sumelectthermal: -1193.090515 hartree
zpe.sumelectthermalent: -1193.089571 hartree
zpe.sumelectthermalfe: -1193.158145 hartree
dipole: -3.6842 1.3884 -0.0440
dipole: 3.9374
quadrupole: -130.8518 -109.3010 -116.2129
quadrupole: 0.9197 5.6926 -10.4990
quadrupole: -12.0632 9.4875 2.5757 0.9197 5.6926 -10.4990
hfenergy: -1193.4194399 hartree
pointgroup: C01 [X(C17H19Cl1O1)]
dipole: 1.3799597 0.6248278 -0.3239323 debye
polarizability: 230.8618907|11.3134881|198.8614206|-17.3956691|5.0846002|150.76676 unknown
InChI: InChI=1S/C17H19ClO/c1-17(2,3)14-6-9-16(19)13(11-14)10-12-4-7-15(18)8-5-12/h4-9,11,19H,10H2,1-3H3
charge 0 multiplicity 1
38 atoms
Cl -5.346445 -1.49886 2.159976
O  -0.168982 3.187565 -0.630685
C  3.517331 -1.241135 0.136194
C  2.574782 -0.028654 -0.055758
C  2.794328 -2.327442 0.988982
C  4.833122 -0.853832 0.859403
C  3.886243 -1.841071 -1.254256
C  1.322517 -0.198864 -0.705693
C  0.406687 0.855879 -0.910464
C  2.897855 1.275621 0.393026
C  -0.930164 0.62183 -1.611446
C  0.767117 2.143822 -0.434867
C  2.005469 2.35468 0.207005
C  -2.023445 0.094182 -0.680329
C  -2.487207 0.880512 0.407307
C  -2.598002 -1.18503 -0.881923
C  -3.495621 0.405197 1.273268
C  -3.608811 -1.681042 -0.024679
C  -4.039993 -0.873586 1.042555
H  3.450286 -3.208174 1.12433
H  2.531947 -1.932408 1.987423
H  1.860979 -2.669831 0.507253
H  4.641327 -0.452785 1.871892
H  5.470517 -1.750129 0.970308
H  5.40932 -0.10227 0.288297
H  4.548916 -2.718195 -1.128162
H  2.988967 -2.171492 -1.807483
H  4.412535 -1.094903 -1.877465
H  1.035662 -1.193403 -1.070315
H  3.849625 1.467678 0.895868
H  -0.782631 -0.097303 -2.438143
H  -1.263576 1.575981 -2.05807
H  2.277848 3.356162 0.566803
H  -2.057095 1.874606 0.570884
H  -2.258944 -1.807176 -1.71905
H  0.20621 4.050352 -0.325798
H  -3.852416 1.015777 2.108084
H  -4.048258 -2.669659 -0.186676
