program: Gaussian 09
title: 000209762
version: EM64L-G09RevD.01
frameworkgroup: C1[X(C20H26N2O4)]
method: RPBEPBE
basis: SDD
operation: Freq
keyword: #p
keyword: freq=noraman
keyword: PBEPBE/SDD
title: #p freq=noraman PBEPBE/SDD
converged: YES YES NO NO
title: Mulliken charges:
elementType: O O O O N N C C C C C C C C C C C C C C C C C C C C H H H H H H H H H H H H H H H H H H H H H H H H H H
charge: -0.282901 -0.279601 -0.283013 -0.299757 -0.254990 -0.095981 -0.417384 0.300226 -0.580941 0.204033 0.439983 0.042993 0.329639 -0.539720 -0.548782 -0.593265 0.214411 0.190436 0.164304 -0.795341 -0.285187 -0.357312 -0.536174 -0.518995 -0.616679 -0.615228 0.233092 0.288114 0.232884 0.232896 0.245400 0.247570 0.260743 0.235543 0.213673 0.241086 0.233123 0.232127 0.222607 0.215991 0.243812 0.221392 0.228749 0.210655 0.259528 0.229251 0.222548 0.226768 0.189774 0.192885 0.232596 0.222420
chargesum: 0.00000
title: Mulliken charges with hydrogens summed into heavy atoms:
elementType: O O O O N N C C C C C C C C C C C C C C C C C C C C
charge: -0.282901 -0.279601 -0.283013 -0.299757 -0.254990 -0.095981 0.103822 0.300226 -0.115160 0.204033 0.439983 0.042993 0.329639 -0.294320 -0.301212 -0.332521 0.214411 0.190436 0.164304 -0.105040 0.180063 0.081286 0.157778 0.180438 0.022411 0.032673
polarizability: 4.57173118e+02 -1.04502958e+01 2.52222866e+02 1.42382604e+01 5.66345266e+00 1.46919180e+02
1716.lowfreq: -9.6395 -1.9521 -0.0014 0.0008 0.0009 3.8154 18.0604 18.3880 25.5872
frequency: 17.9869 18.1352 25.4434 41.3660 48.8165 56.1166 65.2658 79.3533 92.1086 97.1202 119.9243 131.8547 135.3618 144.7765 163.6821 184.8400 193.4566 207.4696 209.8592 213.2847 224.1751 244.5106 250.2932 267.6189 279.3261 304.9157 306.4951 325.6996 339.5401 351.4567 363.3096 388.8601 415.4944 417.4611 434.7728 448.1998 463.8173 489.6142 491.9616 554.1293 580.4718 600.6132 620.1563 634.7772 661.5946 699.7703 714.0753 720.1036 725.2090 735.1114 751.2384 779.3293 801.5470 812.7804 823.2279 860.1370 883.1890 899.3185 922.0838 935.7043 974.0649 988.9400 996.7991 1009.8172 1028.9912 1037.4411 1041.6443 1046.9571 1055.3669 1067.9925 1074.0267 1091.1044 1111.4895 1111.6284 1114.3313 1126.0210 1139.7497 1152.9558 1161.5884 1183.0820 1183.3851 1191.7535 1197.5935 1222.9165 1244.0233 1259.9384 1260.9539 1271.4177 1283.6029 1299.7482 1320.8552 1326.9263 1329.1589 1361.3018 1371.5684 1379.4569 1394.3021 1402.2375 1420.3655 1422.5984 1431.0014 1435.3771 1441.9174 1442.9351 1449.7741 1450.8514 1454.8002 1458.0514 1461.0392 1465.9544 1468.8106 1469.8069 1474.7373 1475.3673 1479.8196 1480.1783 1482.9850 1486.1403 1493.2682 1505.0499 1555.2700 1569.5221 1603.9331 1620.4360 2854.2437 2866.3713 2898.2295 2960.9746 2968.4263 2976.0777 2984.5139 2988.0248 3018.1122 3027.7397 3038.2413 3043.3910 3050.0294 3054.2111 3071.4432 3077.4291 3086.1829 3087.0717 3089.8027 3108.7086 3123.2475 3123.9860 3128.8209 3148.6853 3160.1845 3207.2843
redmass: 4.5247 4.4505 2.6170 3.5125 4.2834 2.2718 4.0117 4.3173 3.3167 2.5993 2.3973 1.2409 2.0096 2.6810 2.8998 4.3591 2.0289 1.9584 1.9136 1.3897 3.0947 2.0420 1.8391 2.0632 3.3199 3.5286 3.4591 3.9941 3.4157 2.8580 4.4605 3.1746 3.6680 3.0351 4.1742 5.6743 3.7701 4.0241 4.2333 4.2266 4.1776 4.9696 5.3034 4.1926 4.6616 4.3373 4.7549 6.2510 3.8496 3.2826 2.6675 4.4589 1.6646 1.5204 2.9555 1.7824 3.5466 1.5856 2.9564 5.9559 4.3540 1.8335 2.5968 4.7783 2.2982 1.6031 1.5076 3.0606 2.0122 1.8649 2.6390 1.3255 1.2641 1.2563 4.3108 2.1708 1.4767 1.3984 1.5040 1.6297 1.6718 1.8610 1.5102 2.2709 2.1307 1.6097 1.3479 2.2638 4.1864 1.2100 2.2541 1.3612 1.5926 3.9149 4.7027 1.4577 2.4846 1.2586 1.8302 1.3671 1.5012 1.6287 1.2191 1.7316 1.1302 1.1665 1.0982 1.0460 1.0603 1.0533 1.0612 2.0983 1.1191 1.1270 1.0878 1.0663 1.3891 1.0547 1.3394 3.3427 6.3943 9.0782 9.2901 7.0093 1.0566 1.0572 1.0687 1.0328 1.0678 1.0351 1.0675 1.0362 1.0728 1.0739 1.0701 1.0787 1.1040 1.0952 1.0969 1.1006 1.0963 1.1005 1.1000 1.0945 1.1079 1.0997 1.1049 1.0916 1.0902 1.0975
irintensity: 0.4209 0.1615 0.3167 1.6159 0.3010 3.0153 4.8001 1.3482 9.1634 1.5276 0.4442 0.2965 0.3721 0.8733 5.8478 1.8843 0.4385 1.0708 2.5601 0.9258 0.2473 0.6562 8.1054 4.3003 4.7977 16.7313 2.9783 2.8204 0.6378 13.4462 20.7516 1.5052 0.7382 13.6219 5.7901 13.1192 6.2389 1.9524 5.5732 1.2210 1.7712 2.1835 9.2447 12.3334 1.8461 0.6407 4.0997 9.4434 22.6110 6.3591 10.2302 4.1393 3.4903 29.6417 7.4694 22.6936 18.6669 21.6081 10.6175 19.3544 41.6666 45.8534 77.9027 149.5036 38.2667 45.9464 9.2264 355.9387 4.0663 87.4403 5.6548 18.0120 20.4745 1.9156 54.4281 104.6796 0.6215 19.4515 16.6557 51.8975 14.9965 23.8890 115.1682 51.9782 268.3116 19.7767 15.1440 27.0948 72.2968 0.5220 4.5669 10.6878 24.1759 111.6517 10.8354 10.6521 21.4776 36.0160 90.1804 38.3637 22.5374 53.4395 19.6128 65.4366 22.8755 66.2238 20.2075 12.8064 13.3553 14.8592 7.9201 125.8926 45.4578 17.9825 19.0148 20.2387 7.7080 9.3285 15.0185 190.6413 2.6901 51.0394 435.0818 10.9076 93.5326 146.0568 90.0378 56.2622 21.5351 117.9362 34.7116 32.9408 50.4978 38.4947 51.0651 24.1235 42.9813 26.2943 15.5246 34.6545 43.3030 26.9813 43.5428 6.6618 16.6153 27.3150 17.9325 8.9010 5.2432 5.7588
temp: 298.150 k
press: 1.00000 atm
elementType: 8 8 8 8 7 7 6 6 6 6 6 6 6 6 6 6 6 6 6 6 6 6 6 6 6 6 1 1 1 1 1 1 1 1 1 1 1 1 1 1 1 1 1 1 1 1 1 1 1 1 1 1
symmnumber: 1
zpe: 1119853.4 jmol-1
zpe.correction: 0.426530 hartree
zpe.thermalcorrener: 0.453671 hartree
zpe.thermalcorrenthalpy: 0.454616 hartree
zpe.thermalcorrgfe: 0.366728 hartree
zpe.sumelectzpe: -1186.145449 hartree
zpe.sumelectthermal: -1186.118307 hartree
zpe.sumelectthermalent: -1186.117363 hartree
zpe.sumelectthermalfe: -1186.205250 hartree
dipole: 1.3277 2.1194 2.1128
dipole: 3.2740
quadrupole: -135.7078 -142.0962 -155.8822
quadrupole: 13.0863 1.3211 -1.5215
quadrupole: 8.8543 2.4659 -11.3202 13.0863 1.3211 -1.5215
hfenergy: -1186.5719786 hartree
pointgroup: C01 [X(C20H26N2O4)]
dipole: 0.5492178 -0.9769178 -0.6349362 debye
polarizability: 457.1410334|11.5330576|250.3957604|-12.0919727|-16.2401219|148.7783703 unknown
InChI: InChI=1S/C20H26N2O4/c1-13-10-16-15-12-18(25-5)17(24-4)11-14(15)6-7-22(16)19(13)20(23)26-9-8-21(2)3/h10-12H,6-9H2,1-5H3
charge 0 multiplicity 1
52 atoms
O  -3.777493 -0.86797 0.702858
O  5.797596 -0.94174 0.303264
O  5.972833 1.843329 -0.321021
O  -3.059719 1.345634 0.45123
N  -0.289752 0.286823 0.243791
N  -7.199534 0.23802 -0.486069
C  -0.12805 1.756414 0.370034
C  0.813692 -0.554213 0.135208
C  1.032693 2.217817 -0.533231
C  2.156315 0.01335 0.013887
C  2.293325 1.398354 -0.293799
C  -1.459598 -0.493337 0.388082
C  -1.068627 -1.866969 0.344681
C  0.344483 -1.888942 0.186945
C  3.317611 -0.781637 0.200299
C  3.584818 1.945097 -0.421042
C  4.607044 -0.223729 0.081465
C  4.747598 1.162641 -0.250048
C  -2.779981 0.1102 0.50466
C  -1.951638 -3.085135 0.423933
C  -5.172102 -0.358516 0.805448
C  -5.8227 -0.29632 -0.590365
C  5.674107 -2.340099 0.721129
C  7.061491 1.252993 -1.127949
C  -8.120943 -0.296605 -1.507459
C  -7.245043 1.714045 -0.417162
H  0.089193 1.99783 1.430026
H  -1.080804 2.233671 0.099865
H  1.223437 3.290793 -0.352928
H  0.71967 2.117494 -1.593023
H  0.955657 -2.785426 0.090698
H  3.197486 -1.834134 0.471979
H  3.726654 3.004069 -0.661954
H  -2.718898 -3.083346 -0.370393
H  -1.3468 -4.003727 0.327577
H  -2.501903 -3.123316 1.380578
H  -5.693947 -1.085738 1.445668
H  -5.157757 0.634955 1.284412
H  -5.177382 0.310704 -1.269722
H  -5.86756 -1.319814 -1.004852
H  6.707417 -2.689273 0.863655
H  5.177389 -2.952011 -0.056939
H  5.116688 -2.424712 1.673857
H  6.731984 1.114574 -2.17602
H  7.389402 0.289615 -0.707069
H  7.873164 1.995288 -1.086848
H  -9.147849 0.053702 -1.296337
H  -8.124773 -1.400239 -1.469018
H  -7.862555 0.01494 -2.551585
H  -6.942879 2.203308 -1.37749
H  -6.570109 2.08352 0.373028
H  -8.270652 2.042763 -0.170331
