program: Gaussian 09
title: 000209672
version: EM64L-G09RevD.01
frameworkgroup: C1[X(C13H20ClN)]
method: RPBEPBE
basis: SDD
operation: Freq
keyword: #p
keyword: freq=noraman
keyword: PBEPBE/SDD
title: #p freq=noraman PBEPBE/SDD
converged: YES YES NO NO
title: Mulliken charges:
elementType: Cl N C C C C C C C C C C C C C H H H H H H H H H H H H H H H H H H H H
charge: -0.067140 -0.298276 -0.070768 -0.237843 0.558573 -0.726159 -0.722827 -0.331575 -0.377262 -0.389608 -0.456449 -0.680394 -0.232975 -0.208455 -0.113097 0.197534 0.197022 0.232190 0.220814 0.241519 0.200450 0.217909 0.201505 0.254707 0.202991 0.169662 0.186095 0.217642 0.235291 0.237504 0.209441 0.208073 0.219900 0.251552 0.252456
chargesum: 0.00000
title: Mulliken charges with hydrogens summed into heavy atoms:
elementType: Cl N C C C C C C C C C C C C C
charge: -0.067140 -0.066086 0.126765 -0.040821 0.558573 -0.063376 -0.048706 0.041077 0.026475 -0.154318 -0.218945 -0.042980 0.018577 0.044001 -0.113097
polarizability: 2.26438155e+02 -1.41248910e+01 1.13615871e+02 2.10378337e+00 8.07193099e+00 1.33873092e+02
1716.lowfreq: -11.7770 -7.0734 -0.0017 0.0012 0.0013 5.5387 26.2106 30.8938 48.7962
frequency: 26.1215 30.8566 48.7716 51.8990 64.8496 111.0929 136.2686 152.3139 172.3405 210.2857 218.1991 222.7854 225.5436 249.7367 286.3163 314.0068 341.5586 368.3448 409.3001 417.4725 445.8091 463.6699 518.9884 539.8265 626.1461 650.4004 668.8315 723.0341 757.3061 774.5133 825.2054 827.6832 838.6443 884.1106 900.7898 908.8469 947.7083 962.6944 968.8867 995.6135 1002.2087 1035.6492 1054.7105 1072.8292 1077.8361 1093.4116 1109.1355 1113.3316 1128.6336 1163.1391 1169.8180 1184.8376 1211.7990 1227.1123 1263.9097 1280.4644 1284.0560 1293.3883 1306.4079 1313.8645 1335.1546 1369.7245 1377.6171 1378.4702 1382.6313 1391.0401 1399.4203 1448.8751 1463.5866 1466.0427 1472.2387 1477.1917 1478.5363 1479.3654 1482.7077 1484.3471 1494.4061 1585.6526 1597.8916 2852.8436 2953.4976 2968.5359 2969.0975 2975.1911 2978.8561 2982.5522 2995.8253 3034.8478 3062.5571 3071.4727 3071.8410 3077.0155 3080.1313 3097.8170 3127.5922 3129.8239 3165.1850 3168.4304 3408.8888
redmass: 4.0390 4.4493 1.9089 3.3914 2.9121 2.9131 2.6990 4.4087 4.3282 1.3229 1.4702 1.2690 1.4529 2.4005 3.2659 3.0206 4.3717 3.7390 2.8711 3.3821 3.1466 3.3393 2.9571 2.7511 6.9528 4.0465 1.5907 3.1882 1.0815 3.2599 1.7659 1.2760 1.7498 1.2687 1.7548 1.5418 1.3707 1.3590 1.2920 3.1268 2.7187 2.4153 2.4895 2.6802 1.7885 2.2231 1.7329 2.1679 2.3705 2.3586 1.8852 1.1203 2.0165 1.3855 1.4126 1.1793 1.4130 1.2007 1.4389 1.4035 1.3976 1.3287 1.3576 4.0161 1.2526 1.2190 2.2997 1.1993 1.1172 1.0537 1.0622 1.7284 1.0664 1.1612 1.0674 1.0633 1.0843 7.2064 6.2986 1.0706 1.0821 1.0641 1.0389 1.0366 1.0431 1.0759 1.0838 1.0987 1.0984 1.1005 1.0987 1.0991 1.0991 1.1000 1.0894 1.0890 1.0951 1.0961 1.0733
irintensity: 0.1135 0.1480 0.4570 0.0881 0.5133 0.6326 1.0737 0.6764 0.1791 0.7064 0.3733 0.1310 0.0140 1.4938 0.1576 1.8482 0.5732 1.3834 0.0962 12.3204 3.1750 5.8890 1.9295 33.3210 0.2887 16.4090 88.8060 2.4898 8.2447 6.4706 43.0335 0.1257 23.3041 3.8034 3.0405 2.8428 0.0935 0.7260 6.8560 54.3805 3.7971 10.5732 11.6176 34.1849 33.7468 23.0381 9.2479 23.7162 31.2681 64.0380 2.9361 1.7367 0.2542 1.1782 2.3055 1.1399 0.2873 4.1064 1.1435 1.1179 6.8080 20.6698 0.9395 0.2357 24.1921 12.1602 5.3091 30.3364 7.6171 2.6951 4.1477 76.2027 13.8494 9.2231 7.0577 12.7967 15.1142 0.9133 3.2328 105.4849 10.4121 30.7456 22.3217 36.7612 13.5224 39.1426 44.1531 14.4364 32.4968 68.5383 50.6572 53.3718 44.6059 16.4167 11.6675 13.6889 8.8646 0.6341 1.5570
temp: 298.150 k
press: 1.00000 atm
elementType: 17 7 6 6 6 6 6 6 6 6 6 6 6 6 6 1 1 1 1 1 1 1 1 1 1 1 1 1 1 1 1 1 1 1 1
symmnumber: 1
zpe: 786007.6 jmol-1
zpe.correction: 0.299375 hartree
zpe.thermalcorrener: 0.316504 hartree
zpe.thermalcorrenthalpy: 0.317448 hartree
zpe.thermalcorrgfe: 0.252724 hartree
zpe.sumelectzpe: -1021.021201 hartree
zpe.sumelectthermal: -1021.004071 hartree
zpe.sumelectthermalent: -1021.003127 hartree
zpe.sumelectthermalfe: -1021.067852 hartree
dipole: -2.9827 -0.2464 0.7576
dipole: 3.0873
quadrupole: -110.1077 -103.1945 -92.1136
quadrupole: 3.3812 0.2159 3.2693
quadrupole: -8.3024 -1.3892 9.6916 3.3812 0.2159 3.2693
hfenergy: -1021.3205754 hartree
pointgroup: C01 [X(C13H20Cl1N1)]
dipole: 1.1730743 0.0378969 -0.3126906 debye
polarizability: 225.564268|15.9138425|121.3633341|6.9068046|-12.3270941|126.9995155 unknown
InChI: InChI=1S/C13H20ClN/c1-4-9-15-11(3)10(2)12-5-7-13(14)8-6-12/h5-8,10-11,15H,4,9H2,1-3H3
charge 0 multiplicity 1
35 atoms
Cl -5.638572 -0.949227 0.053687
N  2.631659 0.369145 -0.304741
C  1.256687 -0.189844 -0.217842
C  0.238383 0.98569 -0.00904
C  -1.212047 0.502814 0.004107
C  0.886663 -1.073871 -1.439018
C  0.574505 1.793034 1.270631
C  3.745684 -0.556133 -0.001812
C  5.100775 0.179041 -0.050174
C  -1.681902 -0.380904 1.012501
C  -2.132577 0.930696 -0.985213
C  6.288678 -0.745505 0.290905
C  -3.020773 -0.828036 1.035376
C  -3.479794 0.499672 -0.981658
C  -3.901967 -0.378007 0.032794
H  1.23628 -0.819837 0.696009
H  0.359621 1.665557 -0.880007
H  2.777755 0.84918 -1.205969
H  1.656584 -1.849909 -1.603629
H  -0.085243 -1.58002 -1.304123
H  0.819548 -0.456435 -2.356587
H  -0.064256 2.690949 1.350666
H  0.413439 1.183712 2.180028
H  1.635167 2.093548 1.244069
H  3.585794 -0.956501 1.019531
H  3.793666 -1.44088 -0.686801
H  5.246254 0.60995 -1.062942
H  5.061562 1.032322 0.65334
H  -0.999646 -0.728264 1.79717
H  -1.796556 1.613704 -1.774605
H  6.185977 -1.163958 1.309852
H  6.353136 -1.594297 -0.416045
H  7.246893 -0.197037 0.24743
H  -3.372491 -1.509231 1.815873
H  -4.180788 0.838983 -1.749868
